Cyclohexanone, 2,2,6-trimethyl-

Normal alkane RI, non-polar column, temperature ramp

Data compiled by: NIST Mass Spectrometry Data Center, William E. Wallace, director

Column type CapillaryCapillaryCapillaryCapillaryCapillary
Active phase DB-1HP-1HP-5HP-1Optima-1
Column length (m) 30.50.60.50.25.
Carrier gas HeliumHeHeHeHe
Substrate
Column diameter (mm) 0.250.20.320.20.20
Phase thickness (μm) 0.250.50.250.50.25
Tstart (C) 50.60.30.60.50.
Tend (C) 220.250.260.220.250.
Heat rate (K/min) 4.2.2.2.3.
Initial hold (min) 2. 2. 3.
Final hold (min) 2.60.28.40.
I 1011.1017.1035.91011.1019.
ReferenceXu, Tang, et al., 2010Bendimerad and Bendiab, 2005Leffingwell and Alford, 2005Valette, Fernandez, et al., 2003Brun, Bessière, et al., 2001
Comment MSDC-RI MSDC-RI MSDC-RI MSDC-RI MSDC-RI
Column type CapillaryCapillaryCapillaryCapillaryCapillary
Active phase PONADB-5 MSDB-1DB-1DB-1
Column length (m) 50.30.50.50.60.
Carrier gas HeHelium
Substrate
Column diameter (mm) 0.20.250.320.320.32
Phase thickness (μm) 0.5
Tstart (C) 40.50.0.50.50.
Tend (C) 250.250.250.250.250.
Heat rate (K/min) 6.4.3.3.4.
Initial hold (min) 5.   0.1
Final hold (min)     5.
I 1029.1036.1012.1007.1012.
ReferenceRamalho, de Freitas, et al., 1999Gomez and Ledbetter, 1994Habu, Flath, et al., 1985Habu, Flath, et al., 1985Flath, Mon, et al., 1983
Comment MSDC-RI MSDC-RI MSDC-RI MSDC-RI MSDC-RI

Normal alkane RI, non-polar column, custom temperature program

Data compiled by: NIST Mass Spectrometry Data Center, William E. Wallace, director

Column type CapillaryCapillaryCapillaryCapillaryCapillary
Active phase TR-5 MSTR-5 MSSLB-5 MSSLB-5 MSPolydimethyl siloxane with 5 % Ph groups
Column length (m) 15.15.30.30.
Carrier gas HeliumHeliumHeliumHelium
Substrate
Column diameter (mm) 0.250.250.250.25
Phase thickness (μm) 0.250.250.250.25
Program 35 0C (3 min) 2 0C/min -> 60 0C (3 min) 2 0C/min -> 80 0C (3 min) 4 0C/min -> 120 0C (3 min) 5 0C/min -> 150 0C (3 min) 15 0C/min -> 240 0C (10 min)35 0C (3 min) 2 0C/min -> 60 0C (3 min) 2 0C/min -> 80 0C (3 min) 4 0C/min -> 120 0C (3 min) 5 0C/min -> 150 0C (3 mion) 15 0C/min -> 240 0C (10 min)not specifiednot specifiednot specified
I 1026.1041.1035.1040.1035.
ReferenceKurashov, Mitrukova, et al., 2014Kurashov, Krylova, et al., 2013Mondello, 2012Mondello, 2012Robinson, Adams, et al., 2012
Comment MSDC-RI MSDC-RI MSDC-RI MSDC-RI MSDC-RI
Column type CapillaryCapillaryCapillaryCapillary
Active phase Polydimethyl siloxane with 5 % Ph groupsDB-1DB-5 MSCP Sil 5 CB
Column length (m)  30.30.25.
Carrier gas  HeliumHeliumHe
Substrate
Column diameter (mm)  0.250.25
Phase thickness (μm)  0.250.250.39
Program not specifiednot specified45 0C (0.75 min) 10 0C/min -> 200 0C 30 0C/min -> 245 0C (1.25 min)not specified
I 1043.1035.1047.1016.
ReferenceRobinson, Adams, et al., 2012Xu, Tang, et al., 2010Cajka, Hajslova, et al., 2007Weyerstahl, Marschall, et al., 1998
Comment MSDC-RI MSDC-RI MSDC-RI MSDC-RI

Kovats' RI, polar column, temperature ramp

Data compiled by: NIST Mass Spectrometry Data Center, William E. Wallace, director

Column type CapillaryCapillaryCapillary
Active phase Carbowax 20MCarbowax 20MCarbowax 20M
Column length (m) 150.70.70.
Carrier gas  N2N2
Substrate
Column diameter (mm) 0.640.280.28
Phase thickness (μm)
Tstart (C) 50.80.80.
Tend (C) 170.200.200.
Heat rate (K/min) 1.2.2.
Initial hold (min) 30.
Final hold (min)
I 1320.1303.1307.
ReferenceButtery, Ling, et al., 1982Yamaguchi and Shibamoto, 1981Yamaguchi and Shibamoto, 1981
Comment MSDC-RI MSDC-RI MSDC-RI

References

Xu, Tang, et al., 2010
Xu, X.; Tang, Z.; Liang, Y., Comparative analysis of plant essential oils by GC-MS coupled with integrated chemometric resolution methods, Anal. Methods, 2010, 2, 4, 359-367, https://doi.org/10.1039/b9ay00213h . [all data]

Bendimerad and Bendiab, 2005
Bendimerad, N.; Bendiab, S.A.T., Composition and antibacterial activity of Pseudocytisus integrifolius (Salisb.) essential oil from Algeria, J. Agric. Food Chem., 2005, 53, 8, 2947-2952, https://doi.org/10.1021/jf047937u . [all data]

Leffingwell and Alford, 2005
Leffingwell, J.C.; Alford, E.D., Volatile constituents of Perique tobacco, Electron. J. Environ. Agric. Food Chem., 2005, 4, 2, 899-915. [all data]

Valette, Fernandez, et al., 2003
Valette, L.; Fernandez, X.; Poulain, S.; Loiseau, A.-M.; Lizzani-Cuvelier, L.; Levieil, R.; Restier, L., Volatile constituents from Romanesco cauliflower, Food Chem., 2003, 80, 3, 353-358, https://doi.org/10.1016/S0308-8146(02)00272-8 . [all data]

Brun, Bessière, et al., 2001
Brun, G.; Bessière, J.-M.; Dijoux-Franca, M.-G.; David, B.; Mariotte, A.-M., Volatile components of Catharanthus roseus (L.) G. Don (Apocynaceae), Flavour Fragr. J., 2001, 16, 2, 116-119, https://doi.org/10.1002/ffj.958 . [all data]

Ramalho, de Freitas, et al., 1999
Ramalho, P.S.; de Freitas, V.A.P.; Macedo, A.; Silva, G.; Silva, A.M.S., Volatile components of Cistus ladanifer leaves, Flavour Fragr. J., 1999, 14, 5, 300-302, https://doi.org/10.1002/(SICI)1099-1026(199909/10)14:5<300::AID-FFJ830>3.0.CO;2-X . [all data]

Gomez and Ledbetter, 1994
Gomez, E.; Ledbetter, C.A., Comparative study of the aromatic profiles of two different plum species: Prunus salicina Lindl and Prunus simonii L., J. Sci. Food Agric., 1994, 65, 1, 111-115, https://doi.org/10.1002/jsfa.2740650116 . [all data]

Habu, Flath, et al., 1985
Habu, T.; Flath, R.A.; Mon, T.R.; Morton, J.F., Volatile components of Rooibos tea (Aspalathus linearis), J. Agric. Food Chem., 1985, 33, 2, 249-254, https://doi.org/10.1021/jf00062a024 . [all data]

Flath, Mon, et al., 1983
Flath, R.A.; Mon, T.R.; Lorenz, G.; Whitten, C.J.; Mackley, J.W., Volatile components of Acacia sp. blossoms, J. Agric. Food Chem., 1983, 31, 6, 1167-1170, https://doi.org/10.1021/jf00120a008 . [all data]