C8H6F4O2S

Reaction thermochemistry data

Data compiled by: John E. Bartmess

Individual Reactions

C8H5F4O2S- + Hydrogen cation = C8H6F4O2S

By formula: C8H5F4O2S- + H+ = C8H6F4O2S

Quantity Value Units Method Reference Comment
Δr324.90kcal/molIMREZhang, Badal, et al., 2013gas phase

References

Zhang, Badal, et al., 2013
Zhang, M.; Badal, M.M.R.; Koppel, I.A.; Mishima, M., Gas-Phase Acidities of alpha- and alpha,alpha-SO2CF3-Substituted Toluenes. Varying Resonance Demand in the Electron-Rich System, Bull. Chem. Soc. Japan, 2013, 86, 7, 813-820, https://doi.org/10.1246/bcsj.20130052 . [all data]