Thiazolidine, 2-methyl-

Van Den Dool and Kratz RI, polar column, custom temperature program

Data compiled by: NIST Mass Spectrometry Data Center, William E. Wallace, director

Column type CapillaryCapillary
Active phase FFAPFFAP
Column length (m) 30.30.
Carrier gas
Substrate
Column diameter (mm) 0.320.32
Phase thickness (μm) 0.250.25
Program 50C (2min) => 6C/min => 180C => 10C/min => 240C(10min)50C (2min) => 6C/min => 180C => 10C/min => 240C(10min)
I 1418.1415.
ReferenceRhlid, Fleury, et al., 2002Rhlid, Fleury, et al., 2002
Comment MSDC-RI MSDC-RI

Normal alkane RI, polar column, temperature ramp

Data compiled by: NIST Mass Spectrometry Data Center, William E. Wallace, director

Column type Capillary
Active phase DB-Wax
Column length (m) 60.
Carrier gas He
Substrate
Column diameter (mm) 0.25
Phase thickness (μm)
Tstart (C) 40.
Tend (C) 200.
Heat rate (K/min) 2.
Initial hold (min) 2.
Final hold (min)
I 1422.
ReferenceUmano, Hagi, et al., 1995
Comment MSDC-RI

References

Rhlid, Fleury, et al., 2002
Rhlid, R.B.; Fleury, Y.; Blank, I.; Fay, L.B.; Welti, D.H.; Vera, F.A.; Juillerat, M.A., Generation of roasted notes based on 2-acetyl-2-thiazoline and its precursor, 2-(1-hydroxyethyl)-4,5-dihydrothiazole, by combined bio and thermal approaches, J. Agric. Food Chem., 2002, 50, 8, 2350-2355, https://doi.org/10.1021/jf011170d . [all data]