Pentaborane (9)-d9

Gas phase ion energetics data

Data compiled by: Henry M. Rosenstock, Keith Draxl, Bruce W. Steiner, and John T. Herron

Ionization energy determinations

IE (eV) Method Reference
10.0EIFehlner and Koski, 1964
9.77EIKaufman, Koski, et al., 1963

Appearance energy determinations

Ion AE (eV) Other Products MethodReferenceComment
B4D4+13.7 ± 0.2?EIFehlner and Koski, 1964
B4D6+12.4 ± 0.2BD3?EIFehlner and Koski, 1964
B5D5+12.4 ± 0.42D2EIFehlner and Koski, 1964
B5D5+12.92 ± 0.032D2EIKaufman, Koski, et al., 1963
B5D6+12.4 ± 0.2D2+DEIFehlner and Koski, 1964
B5D7+11.2 ± 0.2D2EIFehlner and Koski, 1964
B5D7+10.9 ± 0.2D2EIKaufman, Koski, et al., 1963

References

Fehlner and Koski, 1964
Fehlner, T.P.; Koski, W.S., The fragmentation of some boron hydrides by electron impact, J. Am. Chem. Soc., 1964, 86, 581. [all data]

Kaufman, Koski, et al., 1963
Kaufman, J.J.; Koski, W.S.; Kuhns, L.J.; Wright, S.S., Appearance and ionization potentials of selected fragments from isotopically labeled pentaboranes, J. Am. Chem. Soc., 1963, 85, 1369. [all data]