Eicosanal-

Van Den Dool and Kratz RI, non-polar column, temperature ramp

Data compiled by: NIST Mass Spectrometry Data Center, William E. Wallace, director

Column type Capillary
Active phase HP-5
Column length (m) 30.
Carrier gas He
Substrate
Column diameter (mm) 0.25
Phase thickness (μm) 0.25
Tstart (C) 50.
Tend (C) 280.
Heat rate (K/min) 4.
Initial hold (min) 5.
Final hold (min)
I 2224.
ReferenceLazari, Skaltsa, et al., 2000
Comment MSDC-RI

References

Lazari, Skaltsa, et al., 2000
Lazari, D.M.; Skaltsa, H.D.; Constantinidis, T., Volatile constituents of Centaurea pelia DC., C. thessala Hausskn. subsp. drakiensis (Freyn Sint.) Georg. and C. zuccariniana DC. from Greece, Flavour Fragr. J., 2000, 15, 1, 7-11, https://doi.org/10.1002/(SICI)1099-1026(200001/02)15:1<7::AID-FFJ860>3.0.CO;2-3 . [all data]