Germacrene D

Van Den Dool and Kratz RI, polar column, temperature ramp

Data compiled by: NIST Mass Spectrometry Data Center, William E. Wallace, director

Column type CapillaryCapillaryCapillaryCapillaryCapillary
Active phase BP-20HP-InnowaxBP-20HP-20MHP-20M
Column length (m) 50.30.50.50.50.
Carrier gas HeHeHeHeHe
Substrate
Column diameter (mm) 0.220.250.220.20.2
Phase thickness (μm) 0.250.250.250.20.2
Tstart (C) 60.60.60.70.70.
Tend (C) 220.280.220.180.180.
Heat rate (K/min) 2.3.2.4.4.
Initial hold (min)    4.4.
Final hold (min) 20. 20.10.15.
I 1705.1719.1705.1693.1681.
ReferenceBoti, Koukoua, et al., 2007Kundakovic, Fokialakis, et al., 2007Lesueur, de Rocca Serra, et al., 2007Maksimovic, Vidic, et al., 2007Maric, Jukic, et al., 2007
Comment MSDC-RI MSDC-RI MSDC-RI MSDC-RI MSDC-RI
Column type CapillaryCapillaryCapillaryCapillaryCapillary
Active phase RTX-WaxRTX-WaxRTX-WaxHP-20MHP-Innowax
Column length (m) 60.60.60.50.30.
Carrier gas HeHeHeHeHe
Substrate
Column diameter (mm) 0.220.220.220.20.25
Phase thickness (μm) 0.250.250.250.20.5
Tstart (C) 60.60.60.70.60.
Tend (C) 230.230.230.180.260.
Heat rate (K/min) 2.2.2.4.3.
Initial hold (min)    4.
Final hold (min) 30.35.35.15.
I 1676.1701.1700.1673.1727.
ReferenceMuselli, Rossi, et al., 2007Paolini J., Costa J., et al., 2007Paolini, Muselli, et al., 2007Politeo, Jukic, et al., 2007Saroglou, Marin, et al., 2007
Comment MSDC-RI MSDC-RI MSDC-RI MSDC-RI MSDC-RI
Column type CapillaryCapillaryCapillaryCapillaryCapillary
Active phase BP-20Polyethylene GlycolHP-WaxBP-20Supelcowax-10
Column length (m) 50.30.30.50.30.
Carrier gas HeN2N2HeHe
Substrate
Column diameter (mm) 0.220.320.250.220.2
Phase thickness (μm) 0.250.250.250.250.2
Tstart (C) 60.50.60.60.70.
Tend (C) 220.230.220.220.220.
Heat rate (K/min) 2.2.5.2.3.
Initial hold (min)  10.10.
Final hold (min) 20.15. 20.15.
I 1701.1710.1712.1707.1699.
ReferenceBoti, Bighelli, et al., 2006Dob, Dahmane, et al., 2006Flamini, Tebano, et al., 2006Gonny, Cavaleiro, et al., 2006Pinto, Pina-Vaz, et al., 2006
Comment MSDC-RI MSDC-RI MSDC-RI MSDC-RI MSDC-RI
Column type CapillaryCapillaryCapillaryCapillaryCapillary
Active phase Supelcowax-10BP-20PEGDB-WaxDB-Wax
Column length (m) 30.50.30.30.30.
Carrier gas HeHeN2HeHe
Substrate
Column diameter (mm) 0.20.220.320.250.25
Phase thickness (μm) 0.20.250.250.250.25
Tstart (C) 70.60.50.40.40.
Tend (C) 220.220.220.250.250.
Heat rate (K/min) 3.2.2.3.3.
Initial hold (min)   3.
Final hold (min) 15.20.15.20.20.
I 1699.1703.1702.1693.1690.
ReferenceSalgueiro L.R., Pinto E., et al., 2006Boti J.B., Koukoua G., et al., 2005Dob, Berramdane, et al., 2005Fanciullino, Gancel, et al., 2005Gancel, Ollitrault, et al., 2005
Comment MSDC-RI MSDC-RI MSDC-RI MSDC-RI MSDC-RI
Column type CapillaryCapillaryCapillaryCapillaryCapillary
Active phase InnowaxRTX-WaxBP-20MegawaxDB-Wax
Column length (m) 50.60.50.30.30.
Carrier gas HeHeHeHeN2
Substrate
Column diameter (mm) 0.250.220.220.250.25
Phase thickness (μm) 0.250.250.250.250.25
Tstart (C) 50.60.60.40.60.
Tend (C) 220.230.230.220.220.
Heat rate (K/min) 2.2.2.2.5.
Initial hold (min) 3.  6.10.
Final hold (min) 20.35.35.10.
I 1694.1701.1704.1664.1716.
ReferenceLee, Lee, et al., 2005Paolini, Costa, et al., 2005Vellutini, Baldovini, et al., 2005Verzera, Trozzi, et al., 2005Bertoli, Menichini, et al., 2004
Comment MSDC-RI MSDC-RI MSDC-RI MSDC-RI MSDC-RI
Column type CapillaryCapillaryCapillaryCapillaryCapillary
Active phase HP-WaxDB-WaxSupelcowax-10HP-WaxHP-Wax
Column length (m) 30.60.30.30.30.
Carrier gas N2HeHeHeN2
Substrate
Column diameter (mm) 0.250.320.20.250.25
Phase thickness (μm) 0.250.250.20.250.25
Tstart (C) 60.32.70.60.60.
Tend (C) 220.220.220.240.240.
Heat rate (K/min) 5.3.3.3.3.
Initial hold (min) 10.
Final hold (min)   15.
I 1716.1708.1703.1722.1722.
ReferenceBertoli, Pistelli, et al., 2004Brophy, Goldsack, et al., 2004Cavaleiro, Salgueiro, et al., 2004Flamini, Bader, et al., 2004Flamini, Cioni, et al., 2004
Comment MSDC-RI MSDC-RI MSDC-RI MSDC-RI MSDC-RI
Column type CapillaryCapillaryCapillaryCapillaryCapillary
Active phase HP-WaxBP-20HP-InnowaxDB-WaxDB-Wax
Column length (m) 30.50.30.30.30.
Carrier gas N2 HeHeHe
Substrate
Column diameter (mm) 0.250.220.250.250.25
Phase thickness (μm) 0.250.250.50.250.25
Tstart (C) 60.60.60.40.40.
Tend (C) 220.220.260.200.200.
Heat rate (K/min) 5.2.3.4.4.
Initial hold (min) 10.  5.5.
Final hold (min)  20. 20.20.
I 1722.1706.1726.1694.1685.
ReferenceFlamini, Luigi Cioni, et al., 2004Gonny, Bradesi, et al., 2004Grujic-Jovanovic, Skaltsa, et al., 2004Yu, Kim, et al., 2004Yu, Kim, et al., 2004, 2
Comment MSDC-RI MSDC-RI MSDC-RI MSDC-RI MSDC-RI
Column type CapillaryCapillaryCapillaryCapillaryCapillary
Active phase DB-WaxHP-WaxHP-WaxDB-WaxDB-Wax
Column length (m) 30.30.30.30.60.
Carrier gas HeN2N2HeN2
Substrate
Column diameter (mm) 0.250.250.250.250.25
Phase thickness (μm) 0.250.250.250.250.25
Tstart (C) 40.60.60.40.70.
Tend (C) 200.220.220.250.230.
Heat rate (K/min) 4.5.5.3.2.
Initial hold (min) 5.10.10. 2.
Final hold (min) 20.  20.20.
I 1701.1699.1722.1678.1722.
ReferenceZheng, Kim, et al., 2004Bader, Caponi, et al., 2003Bader, Caponi, et al., 2003, 2Brat, Rega, et al., 2003Choi, 2003
Comment MSDC-RI MSDC-RI MSDC-RI MSDC-RI MSDC-RI
Column type CapillaryCapillaryCapillaryCapillaryCapillary
Active phase HP-WaxDB-WaxRTX-WaxHP-InnowaxHP-Innowax
Column length (m) 30.60.30.30.30.
Carrier gas N2H2HeHeHe
Substrate
Column diameter (mm) 0.250.320.250.250.25
Phase thickness (μm) 0.250.250.250.50.5
Tstart (C) 60.40.45.60.60.
Tend (C) 220.245.250.260.260.
Heat rate (K/min) 5.1.53.3.3.
Initial hold (min) 10. 6.
Final hold (min)  20.
I 1722.1690.1684.1727.1710.
ReferenceEmilio Tomei, Manganelli, et al., 2003Gancel, Ollitrault, et al., 2003Shellie, Marriott, et al., 2003Skaltsa, Demetzos, et al., 2003Tzakou, Couladis, et al., 2003
Comment MSDC-RI MSDC-RI MSDC-RI MSDC-RI MSDC-RI
Column type CapillaryCapillaryCapillaryCapillaryCapillary
Active phase MegawaxDB-WaxBP-20RTX-WaxAT-Wax
Column length (m) 30.60.50.30.60.
Carrier gas HeN2HeHeHe
Substrate
Column diameter (mm) 0.250.250.220.250.32
Phase thickness (μm) 0.250.250.250.250.25
Tstart (C) 40.70.60.45.65.
Tend (C) 220.230.220.250.250.
Heat rate (K/min) 2.2.2.3.2.
Initial hold (min) 6.  6.10.
Final hold (min) 10.20.20.10.60.
I 1664.1705.1704.1681.1684.
ReferenceVerzera, Trozzi, et al., 2003Choi, Kim. M.-S.L., et al., 2002Lota, de Rocca Serra, et al., 2002Mondello, Zappia, et al., 2002Pino, Marbot, et al., 2002
Comment MSDC-RI MSDC-RI MSDC-RI MSDC-RI MSDC-RI
Column type CapillaryCapillaryCapillaryCapillaryCapillary
Active phase HP-InnowaxHP-InnowaxBP-20AT-WaxBP-20
Column length (m) 30.30.50.60.50.
Carrier gas HeHeHeHeHe
Substrate
Column diameter (mm) 0.250.250.220.320.22
Phase thickness (μm) 0.500.500.250.250.25
Tstart (C) 60.60.60.65.60.
Tend (C) 260.260.220.250.220.
Heat rate (K/min) 3.3.2.2.2.
Initial hold (min)    10.
Final hold (min) 10.  60.20.
I 1713.1710.1704.1684.1701.
ReferenceCouladis, Baziou, et al., 2001Couladis, Tzakou, et al., 2001Lota, Serra, et al., 2001Pino, Marbot, et al., 2001Rezzi, Bighelli, et al., 2001
Comment MSDC-RI MSDC-RI MSDC-RI MSDC-RI MSDC-RI
Column type CapillaryCapillaryCapillaryCapillaryCapillary
Active phase BP-20DB-WaxDB-WaxDB-WaxCP-Wax 52CB
Column length (m) 50.60.60.60.25.
Carrier gas  HeHeHe
Substrate
Column diameter (mm) 0.220.50.530.530.25
Phase thickness (μm) 0.250.321.01.00.15
Tstart (C) 60.40.50.50.40.
Tend (C) 220.290.220.220.220.
Heat rate (K/min) 2.4.3.3.3.
Initial hold (min)  2.  5.
Final hold (min) 20.5.
I 1704.1717.1715.1715.1708.
ReferenceBaldovini, Ristorcelli, et al., 2000Bartley and Jacobs, 2000Brophy, Goldsack, et al., 2000Brophy, Goldsack, et al., 2000, 2Chagonda, Makanda, et al., 2000
Comment MSDC-RI MSDC-RI MSDC-RI MSDC-RI MSDC-RI
Column type CapillaryCapillaryCapillaryCapillaryCapillary
Active phase DB-WaxDB-WaxSupelcowax-10BP-20BP-20
Column length (m) 60.30.30.50.50.
Carrier gas N2HeHeHeHe
Substrate
Column diameter (mm) 0.250.250.320.220.22
Phase thickness (μm) 0.250.250.250.250.25
Tstart (C) 70.40.75.60.60.
Tend (C) 230.200.200.230.230.
Heat rate (K/min) 2.2.2.52.2.
Initial hold (min) 2.5.
Final hold (min) 20.20. 35.35.
I 1724.1707.1710.1697.1704.
ReferenceChoi and Sawamura, 2000Kim, Thuy, et al., 2000Lazari, Skaltsa, et al., 2000Lota, de Rocca Serra, et al., 2000Lota, de Rocca Serra, et al., 2000
Comment MSDC-RI MSDC-RI MSDC-RI MSDC-RI MSDC-RI
Column type CapillaryCapillaryCapillaryCapillaryCapillary
Active phase MegawaxDB-WaxBP-20InnowaxCarbowax 20M
Column length (m) 30.60.50.60.25.
Carrier gas HeHeHeHeH2
Substrate
Column diameter (mm) 0.250.530.220.250.25
Phase thickness (μm) 0.25 0.250.250.3
Tstart (C) 40.50.60.50.50.
Tend (C) 220.220.230.180.200.
Heat rate (K/min) 2.3.2.2.53.
Initial hold (min) 6.  5.1.
Final hold (min) 10. 35. 20.
I 1664.1715.1704.1721.1690.
ReferenceVerzera, Trozzi, et al., 2000Brophy, Goldsack, et al., 1999Lota, Serra, et al., 1999Stashenko, Cervantes, et al., 1999Bicchi, Rubiolo, et al., 1998
Comment MSDC-RI MSDC-RI MSDC-RI MSDC-RI MSDC-RI
Column type CapillaryCapillaryCapillaryCapillaryCapillary
Active phase DB-WaxDB-WaxCarbowax 20MSP-1000DB-Wax
Column length (m) 60.60.25.85.60.
Carrier gas HeHe HeHe
Substrate
Column diameter (mm) 0.320.320.250.50.32
Phase thickness (μm)   0.3 0.5
Tstart (C) 65.35.50.65.50.
Tend (C) 225.220.200.225.225.
Heat rate (K/min) 3.3.3.3.2.
Initial hold (min)   1.
Final hold (min)   20. 20.
I 1715.1715.1696.1715.1714.
ReferenceBrophy, Goldsack, et al., 1998Brophy, Goldsack, et al., 1998, 2Bicchi, Fresia, et al., 1997Brophy, Goldsack, et al., 1997Sagrero-Nieves, Bartley, et al., 1997
Comment MSDC-RI MSDC-RI MSDC-RI MSDC-RI MSDC-RI
Column type CapillaryCapillaryCapillaryCapillaryCapillary
Active phase CP-Wax 52CBDB-WaxCarbowax 20MDB-WaxHP-20M
Column length (m) 50.60.50.60.50.
Carrier gas H2HeHeHeHe
Substrate
Column diameter (mm) 0.230.250.20.200.25
Phase thickness (μm) 0.120.250.20.20
Tstart (C) 50.50.30.70.60.
Tend (C) 200.180.170.180.190.
Heat rate (K/min) 1.52.54.2.3.
Initial hold (min) 10.5.2.5.
Final hold (min) 10. 20.
I 1720.1726.1708.1713.1705.
ReferenceChyau, Mau, et al., 1996Stashenko, Prada, et al., 1996Píry, Príbela, et al., 1995Stashenko, Wiame, et al., 1995Chung, Eiserich, et al., 1993
Comment MSDC-RI MSDC-RI MSDC-RI MSDC-RI MSDC-RI
Column type Capillary
Active phase DB-Wax
Column length (m) 30.
Carrier gas He
Substrate
Column diameter (mm) 0.32
Phase thickness (μm) 0.5
Tstart (C) 40.
Tend (C) 220.
Heat rate (K/min) 3.
Initial hold (min)
Final hold (min)
I 1702.
ReferenceLe Quere and Latrasse, 1990
Comment MSDC-RI

Van Den Dool and Kratz RI, polar column, custom temperature program

Data compiled by: NIST Mass Spectrometry Data Center, William E. Wallace, director

Column type CapillaryCapillaryCapillaryCapillaryCapillary
Active phase HP-InnowaxDB-WaxCarbowax 20MBP-20Stabilwax
Column length (m) 30.30.25.25.
Carrier gas HeHeH2HeHe
Substrate
Column diameter (mm) 0.250.250.320.25
Phase thickness (μm)  0.250.250.25
Program 40C(8min) => 3C/min => 180C => 20C/min => 230C (20min)40 (5min) => 4C/min => 140C => 4C/min => 200C (20min)40C(8min) => 3C/min => 180C => 20C/min => 230C40C(8min) => 3C/min => 180C => 20C/min => 230C50C(8min) => 4C/min => 180C(10min) => 5C/min => 220C
I 1726.1699.1713.1663.1675.
ReferenceCarrer, Vanderlinde, et al., 2007Zheng, Kim, et al., 2005Frizzo, Lorenzo, et al., 2004Lorenzo, Loayza, et al., 2003Hudaib, Speroni, et al., 2002
Comment MSDC-RI MSDC-RI MSDC-RI MSDC-RI MSDC-RI
Column type CapillaryCapillaryCapillaryCapillary
Active phase RTX-WaxCarbowax 20MBP-20HP-Innowax
Column length (m) 60.25. 30.
Carrier gas  H2 He
Substrate
Column diameter (mm) 0.250.32 0.25
Phase thickness (μm) 0.250.25 0.25
Program not specified40 0C (8 min) 3 K/min -> 180 0C 20 K/min -> 230 0Cnot specified60C(8min) => 3C/min => 180C(5min) => 40C/min => 250C
I 1705.1683.1698.1700.
ReferenceCavalli, Ranarivelo, et al., 2001Lorenzo, Saavedra, et al., 2001Filippini, Tomi, et al., 2000Bisio, Ciarallo, et al., 1998
Comment MSDC-RI MSDC-RI MSDC-RI MSDC-RI

Kovats' RI, non-polar column, isothermal

View large format table.

Column type Active phase Temperature (C) I Reference Comment
CapillaryEC-1130.1471.Szafranek, Chrapkowska, et al., 200530. m/0.25 mm/0.25 μm
CapillaryEC-1150.1485.Szafranek, Chrapkowska, et al., 200530. m/0.25 mm/0.25 μm
CapillaryOV-101130.1470.Clarke, Perry, et al., 1994

Kovats' RI, non-polar column, temperature ramp

View large format table.

Column type Active phase I Reference Comment
CapillaryDB-51480.Adams, González Elizondo, et al., 200630. m/0.26 mm/0.25 μm, He, 3. K/min; Tstart: 60. C; Tend: 246. C
CapillaryDB-5MS1474.Angioni, Barra, et al., 200630. m/0.25 mm/0.25 μm, He, 3. K/min, 180. C @ 15. min; Tstart: 60. C
CapillaryHP-5MS1480.Hazzit, Baaliouamer, et al., 200630. m/0.25 mm/0.25 μm, He, 60. C @ 8. min, 2. K/min, 280. C @ 30. min
CapillaryHP-5MS1503.Jalali-Heravi, Zekavat, et al., 200660. m/0.25 mm/0.25 μm, He, 40. C @ 1. min, 3. K/min, 250. C @ 20. min
CapillaryDB-5MS1451.Marongiu, Porcedda, et al., 200630. m/0.25 mm/0.25 μm, He, 3. K/min, 280. C @ 30. min; Tstart: 60. C
CapillaryDB-11486.Mevy, Bessiere, et al., 2006He, 60. C @ 3. min, 3. K/min; Column length: 25. m; Column diameter: 0.2 mm; Tend: 220. C
CapillaryHP-51481.Oliveira, Leitao, et al., 200625. m/0.2 mm/0.33 μm, 3. K/min; Tstart: 60. C; Tend: 240. C
CapillaryBP-11473.Raina, Verma, et al., 200625. m/0.32 mm/0.25 μm, N2, 5. K/min, 220. C @ 13. min; Tstart: 60. C
CapillaryDB-51482.Sylvestre, Pichette, et al., 200630. m/0.25 mm/0.25 μm, 40. C @ 2. min, 2. K/min, 210. C @ 33. min
CapillaryHP-5MS1519.Tepe, Askin Akpulat, et al., 200630. m/0.25 mm/0.25 μm, He, 3. K/min; Tstart: 50. C; Tend: 240. C
CapillarySPB-11485.Walde, Jyothirmayi, et al., 200630. m/0.32 mm/0.25 μm, He, 60. C @ 4. min, 4. K/min, 240. C @ 2. min
CapillaryDB-51485.Adams, Morris, et al., 200530. m/0.26 mm/0.25 μm, He, 3. K/min; Tstart: 60. C; Tend: 246. C
CapillaryDB-51480.Adams and Nguyen, 200530. m/0.26 mm/0.25 μm, He, 3. K/min; Tstart: 60. C; Tend: 246. C
CapillaryHP-5MS1485.Asuming, Beauchamp, et al., 200530. m/0.25 mm/0.25 μm, He, 50. C @ 10. min, 3. K/min, 250. C @ 5. min
CapillaryDB-5MS1482.Maia, Andrade, et al., 200530. m/0.25 mm/0.25 μm, He, 3. K/min; Tstart: 60. C; Tend: 240. C
CapillaryDB-51485.Medina, Lucero, et al., 200530. m/0.25 mm/0.25 μm, Helium, 3. K/min; Tstart: 60. C; Tend: 255. C
CapillaryHP-5MS1519.Tepe, Sokmen, et al., 200530. m/0.25 mm/0.25 μm, He, 3. K/min; Tstart: 50. C; Tend: 240. C
CapillarySPB-51508.Gauvin, Lecomte, et al., 200460. m/0.32 mm/1. μm, He, 4. K/min, 200. C @ 30. min; Tstart: 60. C
CapillaryHP-51468.Mahmood, Kaul, et al., 200430. m/0.25 mm/0.25 μm, He, 50. C @ 5. min, 3. K/min, 280. C @ 25. min
CapillaryDB-51481.Merle, Morón, et al., 200425. m/0.25 mm/0.25 μm, He, 60. C @ 6. min, 5. K/min, 180. C @ 15. min
CapillaryDB-51480.Morteza-Semnani, Azadbakht, et al., 200430. m/0.25 mm/0.25 μm, He, 60. C @ 4. min, 4. K/min; Tend: 220. C
CapillaryDB-5MS1480.Palmeira, Moura, et al., 200430. m/0.25 mm/0.25 μm, He, 3. K/min; Tstart: 60. C; Tend: 240. C
CapillaryCP Sil 8 CB1476.Schwob, Bessiere, et al., 200430. m/0.25 mm/0.25 μm, H2, 50. C @ 2. min, 3. K/min; Tend: 220. C
CapillaryHP-5MS1472.Siani, Garrido, et al., 200430. m/0.32 mm/0.25 μm, He, 70. C @ 5. min, 3. K/min; Tend: 250. C
CapillaryHP-5MS1487.Siani, Garrido, et al., 200430. m/0.32 mm/0.25 μm, He, 70. C @ 5. min, 3. K/min; Tend: 250. C
CapillaryDB-11477.Velasco-Negueruela, Sanz, et al., 200450. m/0.25 mm/0.25 μm, N2, 4. K/min; Tstart: 95. C; Tend: 240. C
CapillarySPB-11461.Yadav, Chauhan, et al., 200430. m/0.32 mm/0.25 μm, He, 50. C @ 2. min, 2. K/min, 250. C @ 5. min
CapillaryDB-51470.Amparo Blázquez, Pérez, et al., 2003He, 40. C @ 5. min, 3. K/min, 280. C @ 5. min; Column length: 25. m; Column diameter: 0.25 mm
CapillaryDB-51496.Baranauskiene, Venskutonis, et al., 200350. m/0.32 mm/0.25 μm, He, 50. C @ 2. min, 5. K/min, 280. C @ 10. min
CapillaryHP-5MS1496.Baranauskiene, Venskutonis, et al., 2003, 230. m/0.25 mm/0.25 μm, He, 50. C @ 2. min, 4. K/min, 280. C @ 10. min
CapillaryHP-51508.Bouzouita, Kachouri, et al., 200330. m/0.25 mm/1. μm, He, 40. C @ 1. min, 5. K/min; Tend: 250. C
CapillaryHP-5MS1461.Couladis, Chinou, et al., 200330. m/0.25 mm/0.25 μm, He, 3. K/min; Tstart: 60. C; Tend: 280. C
CapillaryHP-5MS1464.Gkinis, Tzakou, et al., 200330. m/0.25 mm/0.25 μm, He, 3. K/min; Tstart: 60. C; Tend: 280. C
CapillaryCP Sil 5 CB1478.Ogunwande, Olawore, et al., 200325. m/0.25 mm/0.15 μm, H2, 3. K/min; Tstart: 50. C; Tend: 230. C
CapillarySPB-11455.Jayaprakasha, Rao, et al., 200230. m/0.32 mm/0.25 μm, He, 60. C @ 2. min, 2. K/min, 225. C @ 5. min
CapillaryHP-51482.Juliani and Simon, 200230. m/0.25 mm/0.25 μm, He, 60. C @ 1. min, 4. K/min, 200. C @ 15. min
CapillaryMethyl Silicone1493.Palá-Paúl, Pérez-Alonso, et al., 200250. m/0.25 mm/0.25 μm, He, 4. K/min; Tstart: 70. C; Tend: 240. C
CapillarySE-301481.Palá-Paúl, Velasco-Negueruela, et al., 200225. m/0.22 mm/0.25 μm, He, 4. K/min; Tstart: 70. C; Tend: 220. C
CapillaryBP-11476.Raina, Lal, et al., 200260. m/0.32 mm/0.25 μm, N2, 5. K/min; Tstart: 60. C; Tend: 220. C
CapillaryBP-11461.Raina, Srivastava, et al., 200225. m/0.55 mm/0.25 μm, N2, 5. K/min, 220. C @ 15. min; Tstart: 60. C
CapillaryCross-Linked Methylsilicone1479.Rajeswara Rao, Kaul, et al., 200250. m/0.2 mm/0.25 μm, He, 4. K/min; Tstart: 100. C; Tend: 280. C
CapillaryBP-11480.Rajeswara Rao, 200225. m/0.5 mm/0.25 μm, N2, 5. K/min, 220. C @ 10. min; Tstart: 60. C
CapillaryBP-11480.Rao B.R.R., 200225. m/0.5 mm/0.25 μm, 5. K/min, 220. C @ 10. min; Tstart: 60. C
CapillaryHP-5MS1480.Salido, Altarejos, et al., 200230. m/0.25 mm/0.25 μm, He, 3. K/min; Tstart: 50. C; Tend: 250. C
CapillaryBP-11473.Shawl, Srivastava, et al., 200230. m/0.32 mm/0.25 μm, N2, 5. K/min, 220. C @ 13. min; Tstart: 60. C
CapillaryHP-51485.Yáñez, Pinzón, et al., 200250. m/0.25 mm/0.25 μm, He, 50. C @ 5. min, 2.5 K/min; Tend: 250. C
CapillaryPTE-51481.Gudzic, Dordevic, et al., 200160. m/0.32 mm/0.39 μm, H2, 4.3 K/min; Tstart: 60. C; Tend: 285. C
CapillaryBP-11478.Jain, Aggarwal, et al., 200125. m/0.55 mm/0.25 μm, N2, 5. K/min, 220. C @ 15. min; Tstart: 60. C
CapillaryBP-11478.Jain, Srivastava, et al., 200125. m/0.55 mm/0.25 μm, N2, 5. K/min, 220. C @ 15. min; Tstart: 60. C
CapillaryHP-51480.Kitic, Palic, et al., 200125. m/0.32 mm/0.52 μm, H2, 4. K/min; Tstart: 40. C; Tend: 240. C
CapillaryDB-51477.Moreira, Sousa, et al., 2001H2, 3. K/min; Column length: 30. m; Column diameter: 0.20 mm; Tstart: 60. C; Tend: 240. C
CapillaryDB-11480.Nagalakshmi, Thangadurai, et al., 200128. m/0.25 mm/0.25 μm, He, 50. C @ 1. min, 4.5 K/min; Tend: 270. C
CapillaryDB-11467.Palá-Paúl, Velasco-Negueruela, et al., 200150. m/0.25 mm/0.25 μm, N2, 4. K/min; Tstart: 80. C; Tend: 225. C
CapillaryHP-51479.Tzakou and Couladis, 200130. m/0.25 mm/0.25 μm, He, 3. K/min; Tstart: 60. C; Tend: 280. C
CapillarySE-541480.Adams, 200030. m/0.26 mm/0.25 μm, He, 3. K/min; Tstart: 60. C; Tend: 246. C
CapillaryDB-51480.Adams, 2000, 230. m/0.26 mm/0.25 μm, He, 3. K/min; Tstart: 60. C; Tend: 240. C
CapillarySE-541480.Adams, 2000, 330. m/0.26 mm/0.25 μm, 3. K/min; Tstart: 60. C; Tend: 246. C
CapillaryDB-51480.Adams, 2000, 430. m/0.26 mm/0.25 μm, He, 3. K/min; Tstart: 60. C; Tend: 246. C
CapillarySE-301465.Kardali, Velasco-Negueruela, et al., 200025. m/0.22 mm/0.25 μm, He, 5. K/min; Tstart: 70. C; Tend: 220. C
CapillaryPTE-51480.Mitic and Dordevic, 200060. m/0.32 mm/0.3 μm, H2, 4.3 K/min; Tstart: 60. C; Tend: 285. C
CapillaryBP-11481.Rao, Kaul, et al., 2000N2, 5. K/min, 220. C @ 10. min; Column length: 25. m; Column diameter: 0.5 mm; Tstart: 60. C
CapillaryBP-11481.Rao, Sastry, et al., 200025. m/0.50 mm/0.25 μm, N2, 5. K/min, 220. C @ 10. min; Tstart: 60. C
CapillaryHP-5MS1480.Roussis, Tsoukatou, et al., 200030. m/0.25 mm/0.25 μm, He, 3. K/min; Tstart: 60. C; Tend: 280. C
CapillaryDB-51480.Tzakou, Harvala, et al., 200050. C @ 5. min, 3. K/min; Column length: 30. m; Column diameter: 0.32 mm; Tend: 250. C
CapillaryDB-51480.Adams, 199930. m/0.26 mm/0.25 μm, He, 3. K/min; Tstart: 60. C; Tend: 246. C
CapillaryCP Sil 5 CB1488.Kaul, Gujral, et al., 1999He, 5. K/min; Column length: 25. m; Column diameter: 0.25 mm; Tstart: 60. C; Tend: 280. C
CapillaryOV-1011487.Kuiate, Zollo, et al., 19995. K/min; Column length: 25. m; Column diameter: 0.32 mm; Tstart: 50. C; Tend: 200. C
CapillaryDB-51480.Lopes, Kato, et al., 19993. K/min; Column length: 30. m; Column diameter: 0.25 mm; Tstart: 60. C; Tend: 240. C
CapillaryDB-51480.Lopes, Kato, et al., 19993. K/min; Column length: 30. m; Column diameter: 0.25 mm; Tstart: 60. C; Tend: 240. C
CapillaryHP-5MS1474.Siani, Ramos, et al., 199930. m/0.32 mm/0.25 μm, He, 70. C @ 5. min, 3. K/min; Tend: 250. C
CapillaryDB-51480.da Silva, Andrade, et al., 199930. m/0.25 mm/0.25 μm, He, 3. K/min; Tstart: 60. C; Tend: 240. C
CapillaryDB-51480.da Silva, Zoghbi, et al., 199930. m/0.25 mm/0.25 μm, He, 4. K/min; Tstart: 60. C; Tend: 240. C
CapillaryDB-11473.Bylaite, Venskutonis, et al., 199860. m/0.25 mm/0.25 μm, He, 50. C @ 5. min, 3. K/min, 250. C @ 10. min
CapillaryBP-11480.Kulkarni, Mallavarapu, et al., 1998N2, 5. K/min; Column length: 25. m; Column diameter: 0.25 mm; Tstart: 60. C; Tend: 220. C
CapillaryCP Sil 5 CB1471.Szafranek, Malinski, et al., 199830. m/0.25 mm/0.25 μm, Ar, 3. K/min; Tstart: 60. C; Tend: 220. C
CapillaryCP Sil 8 CB1479.Szafranek, Malinski, et al., 199825. m/0.15 mm/0.12 μm, Ar, 3. K/min; Tstart: 60. C; Tend: 220. C
CapillaryDB-51479.Zoghbi, Andrade, et al., 199830. m/0.25 mm/0.25 μm, He, 4. K/min; Tstart: 60. C; Tend: 240. C
CapillaryDB-11479.Fiorini, Fourasté, et al., 1997He, 3. K/min; Column length: 30. m; Column diameter: 0.23 mm; Tstart: 50. C; Tend: 200. C
CapillaryBPX-51480.Fournier, Hadjiakhoondi, et al., 199750. m/0.22 mm/0.25 μm, N2, 60. C @ 10. min, 2. K/min; Tend: 185. C
CapillarySPB-11477.Jayaprakasha, Jaganmohan Rao, et al., 199730. m/0.32 mm/0.25 μm, He, 60. C @ 2. min, 5. K/min, 250. C @ 5. min
CapillaryDB-51481.Tellez, Estell, et al., 199730. m/0.25 mm/0.25 μm, He, 3. K/min; Tstart: 60. C; Tend: 240. C
CapillaryDB-51475.Loayza, Abujder, et al., 199540. C @ 2. min, 2. K/min, 210. C @ 120. min; Column length: 30. m
CapillaryDB-51480.Loayza, Abujder, et al., 199540. C @ 2. min, 2. K/min, 210. C @ 120. min; Column length: 30. m
CapillaryDB-51481.Loayza, Abujder, et al., 199540. C @ 2. min, 2. K/min, 210. C @ 120. min; Column length: 30. m
CapillaryOV-11473.Bicchi, Frattini, et al., 198823. m/0.32 mm/0.3 μm, H2, 3. K/min; Tstart: 50. C; Tend: 200. C
CapillaryBP-11487.Ekundayo, Laakso, et al., 1988H2, 65. C @ 2. min, 5. K/min; Column length: 50. m; Column diameter: 0.33 mm; Tend: 220. C
CapillaryOV-1011486.Gaydou, Randriamiharisoa, et al., 1986100. m/0.3 mm/0.15 μm, H2, 2. K/min; Tstart: 90. C; Tend: 220. C

Kovats' RI, non-polar column, custom temperature program

View large format table.

Column type Active phase I Reference Comment
CapillaryHP-51483.de Marchese, de Heluani, et al., 2007He; Program: 60C(5min) => 3C/min => 100C => 1C/min => 160C => 10C/min => 240C(10min)
CapillaryCP Sil 8 CB1485.Radusiene, Judzentiene, et al., 200550. m/0.32 mm/0.25 μm, He; Program: 60C(1min) => 3C/min => 70C => 15C/min => 170C(8min) => 5C/min => 250C
CapillaryDB-5MS1477.Tuberoso, Kowalczyk, et al., 200530. m/0.25 mm/0.25 μm, He; Program: 60C(5min) => 2C/min => 140C= 5C/min => 250C(5min)
CapillaryBP-11477.Dwivedi, Khan, et al., 200425. m/0.25 mm/0.25 μm, N2; Program: 60C => 5C/min => 220C(5min) => 3C/min => 245C(5min)
CapillaryBP-11484.Khan, Srivastava, et al., 200325. m/0.25 mm/0.25 μm, N2; Program: 60C => 5C/min => 220C (5min) => 3C/min => 245 C (5min)
CapillaryBP-11467.Raina, Srivastava, et al., 200325. m/0.32 mm/0.25 μm, N2; Program: 60C => 5C/min => 220C(5min) => 3C/min => 245C(5min)
CapillaryHP-51480.Shellie and Marriott, 200330. m/0.25 mm/0.25 μm, He; Program: not specified
CapillaryBP-11484.Khan, Srivastava, et al., 200230. m/0.32 mm/0.25 μm, N2; Program: 60 C 5 C/min -> 220 C (5 min) 3 C/min -> 245 C (5 min)
CapillaryHP-51477.Frizzo, Serafini, et al., 200130. m/0.32 mm/0.25 μm, H2; Program: 60 0C (8 min) 3 K/min -> 180 0C 20 K/min (20 min)
CapillaryDB-51480.Moreira, Sousa, et al., 2001H2; Column length: 30. m; Column diameter: 0.20 mm; Program: not specified
CapillaryAT-51481.Khouri, Usubillaga, et al., 200060. m/0.25 mm/0.25 μm, He; Program: 60 C 4K/min -> 200 C 10 K/min -> 280 C
CapillaryDB-5MS1480.Maia, Andrade, et al., 200030. m/0.25 mm/0.25 μm, He; Program: 40C => 2C/min => 60C => 4C/min => 260C
CapillaryAT-51496.Rojas and Usubillaga, 200060. m/0.25 mm/0.25 μm, He; Program: 60 C (1 min) 4 K/min -> 200 C 10 K/min -> 280 C
CapillaryDB-51480.Adams, 199830. m/0.26 mm/0.25 μm; Program: not specified
CapillaryDB-51479.Santos, Andrade, et al., 199830. m/0.25 mm/0.25 μm, He; Program: 40C => 2C/min => 60C => 4C/min => 240C
CapillarySF-961497.Okamoto, Ellison, et al., 1981Column length: 127. m; Column diameter: 0.75 mm; Program: not specified
CapillarySF-961488.Malingré and Maarse, 1974Column length: 150. m; Column diameter: 0.75 mm; Program: not specified

Kovats' RI, polar column, isothermal

View large format table.

Column type Active phase Temperature (C) I Reference Comment
CapillaryCarbowax 20M130.1718.Malingré and Maarse, 1974Column length: 150. m; Column diameter: 0.75 mm

Kovats' RI, polar column, temperature ramp

View large format table.

Column type Active phase I Reference Comment
CapillaryStabilwax1742.Hazzit, Baaliouamer, et al., 200630. m/0.32 mm/1. μm, N2, 50. C @ 3. min, 2. K/min, 220. C @ 15. min
CapillarySupelcowax-101708.Sylvestre, Pichette, et al., 200630. m/0.25 mm/0.25 μm, 40. C @ 2. min, 2. K/min, 210. C @ 33. min
CapillaryHP-Wax1739.Gauvin, Lecomte, et al., 200450. m/0.2 mm/0.4 μm, He, 4. K/min, 230. C @ 30. min; Tstart: 60. C
CapillaryInnowax1712.Mahmood, Kaul, et al., 200430. m/0.25 mm/0.25 μm, He, 5. K/min, 190. C @ 5. min; Tstart: 40. C
CapillaryDB-Wax1676.Nébié, Yaméogo, et al., 200430. m/0.25 mm/0.25 μm, 2. K/min, 240. C @ 40. min; Tstart: 40. C
CapillaryInnowax1687.Yáñez, Pinzón, et al., 200250. m/0.25 mm/0.25 μm, He, 50. C @ 5. min, 2.5 K/min; Tend: 180. C
CapillarySupelcowax-101710.Tzakou and Couladis, 200130. m/0.32 mm/0.25 μm, He, 3. K/min; Tstart: 75. C; Tend: 230. C
CapillaryCarbowax 20M1724.Kulkarni, Mallavarapu, et al., 1998N2, 5. K/min; Column length: 25. m; Column diameter: 0.25 mm; Tstart: 60. C; Tend: 200. C
CapillaryCarbowax1714.Szafranek, Malinski, et al., 199830. m/0.25 mm/0.25 μm, Ar, 4. K/min; Tstart: 50. C; Tend: 220. C
CapillarySupelcowax-101707.Loayza, Abujder, et al., 199540. C @ 2. min, 2. K/min, 210. C @ 120. min; Column length: 30. m
CapillarySupelcowax-101696.Loayza, Abujder, et al., 199540. C @ 2. min, 2. K/min, 210. C @ 120. min; Column length: 30. m
CapillarySupelcowax-101696.Loayza, Abujder, et al., 199540. C @ 2. min, 2. K/min, 210. C @ 120. min; Column length: 30. m
CapillaryDB-Wax1702.Umano, Hagi, et al., 1994He, 40. C @ 2. min, 2. K/min; Column length: 60. m; Column diameter: 0.25 mm; Tend: 200. C
CapillarySupelcowax-20M1674.Bicchi, Frattini, et al., 198823. m/0.32 mm/0.30 μm, H2, 50. C @ 1. min, 3. K/min; Tend: 200. C
CapillaryCarbowax 20M1685.Randriamiharisoa and Gaydou, 1987He, 2. K/min; Column length: 50. m; Column diameter: 0.3 mm; Tstart: 70. C; Tend: 210. C
CapillaryBP-201719.Wyllie, Cook, et al., 198770. C @ 2. min, 4. K/min; Column length: 25. m; Column diameter: 0.332 mm; Tend: 200. C
CapillaryCarbowax 20M1678.Gaydou, Randriamiharisoa, et al., 198650. m/0.3 mm/0.15 μm, H2, 2. K/min; Tstart: 70. C; Tend: 210. C
CapillaryCarbowax 20M1710.Tressl, Friese, et al., 1978He, 2. K/min; Column length: 50. m; Column diameter: 0.28 mm; Tstart: 70. C; Tend: 190. C

Kovats' RI, polar column, custom temperature program

View large format table.

Column type Active phase I Reference Comment
CapillaryHP-Innowax1708.Frizzo, Serafini, et al., 200130. m/0.32 mm/0.50 μm, H2; Program: 60 0C (8 min) 3 K/min -> 180 0C 20 K/min -> 230 0C (20 min)
CapillaryCarbowax1728.Okamoto, Ellison, et al., 1981Column length: 127. m; Column diameter: 0.75 mm; Program: not specified

Van Den Dool and Kratz RI, non-polar column, temperature ramp

View large format table.

Column type Active phase I Reference Comment
CapillaryEquity-5MS1482.Belsito E.L., Carbone C., et al., 200730. m/0.25 mm/0.25 μm, He, 3. K/min, 250. C @ 10. min; Tstart: 50. C
CapillaryHP-51484.Benzo, Gilardoni, et al., 200730. m/0.25 mm/0.25 μm, He, 40. C @ 1. min, 5. K/min, 250. C @ 10. min
CapillaryBP-11480.Boti, Koukoua, et al., 200750. m/0.22 mm/0.25 μm, He, 2. K/min, 220. C @ 20. min; Tstart: 60. C
CapillaryCP-Sil PONA GB1501.Cunicao, Lopes, et al., 2007100. m/0.25 mm/0.25 μm, He, 140. C @ 10. min, 5. K/min, 230. C @ 25. min
CapillarySPB-51516.Engel and Ratel, 200760. m/0.32 mm/1. μm, 40. C @ 2. min, 3. K/min, 230. C @ 10. min
CapillaryDB-51481.Flamini, Cioni, et al., 200730. m/0.25 mm/0.25 μm, He, 3. K/min; Tstart: 60. C; Tend: 240. C
CapillaryDB-51478.Hongratanaworakit and Buchbauer, 200730. m/0.25 mm/0.25 μm, He, 3. K/min; Tstart: 60. C; Tend: 246. C
CapillaryHP-5MS1476.Kundakovic, Fokialakis, et al., 200730. m/0.25 mm/0.25 μm, He, 3. K/min; Tstart: 60. C; Tend: 280. C
CapillaryBP-11476.Lesueur, de Rocca Serra, et al., 200750. m/0.22 mm/0.25 μm, He, 2. K/min, 220. C @ 20. min; Tstart: 60. C
CapillaryDB-51481.Maccioni, Baldini, et al., 200730. m/0.25 mm/0.25 μm, He, 3. K/min; Tstart: 60. C; Tend: 240. C
CapillaryDB-51481.Maccioni, Baldini, et al., 200730. m/0.25 mm/0.25 μm, He, 3. K/min; Tstart: 60. C; Tend: 240. C
CapillaryDB-51480.Martins, Santos, et al., 200730. m/0.22 mm/0.25 μm, 60. C @ 2. min, 3. K/min; Tend: 240. C
CapillaryMethyl Silicone1468.Melo, Corrêa, et al., 200730. m/0.25 mm/0.25 μm, He, 2. K/min, 220. C @ 15. min; Tstart: 80. C
CapillaryRTX-11473.Muselli, Rossi, et al., 200760. m/0.22 mm/0.25 μm, He, 2. K/min, 230. C @ 30. min; Tstart: 60. C
CapillaryRTX-11477.Paolini J., Costa J., et al., 200760. m/0.22 mm/0.25 μm, He, 2. K/min, 230. C @ 35. min; Tstart: 60. C
CapillaryRTX-11479.Paolini, Muselli, et al., 200760. m/0.22 mm/0.25 μm, He, 2. K/min, 230. C @ 35. min; Tstart: 60. C
CapillaryHP-1011444.Politeo, Jukic, et al., 200725. m/0.2 mm/0.2 μm, He, 70. C @ 2. min, 3. K/min, 200. C @ 15. min
CapillaryHP-51481.Quijano, Salamanca, et al., 200730. m/0.25 mm/0.25 μm, He, 50. C @ 4. min, 4. K/min, 250. C @ 10. min
CapillarySPB-11465.Radulovic, Lazarevic, et al., 200730. m/0.25 mm/0.25 μm, He, 50. C @ 3. min, 5. K/min, 250. C @ 15. min
CapillaryHP-5MS1480.Radulovic, Lazarevic, et al., 200730. m/0.25 mm/0.25 μm, He, 60. C @ 5. min, 4. K/min; Tend: 280. C
CapillaryDB-51477.Rout, Rao, et al., 200725. m/0.25 mm/0.25 μm, He, 2. K/min, 200. C @ 60. min; Tstart: 60. C
CapillaryDB-51492.Sabulal, Dan, et al., 200730. m/0.25 mm/0.25 μm, He, 5. K/min; Tstart: 60. C; Tend: 260. C
CapillaryHP-5MS1480.Saroglou, Arfan, et al., 200730. m/0.25 mm/0.25 μm, He, 60. C @ 5. min, 4. K/min; Tend: 280. C
CapillaryHP-5MS1480.Saroglou, Marin, et al., 200730. m/0.25 mm/0.25 μm, He, 60. C @ 5. min, 4. K/min; Tend: 280. C
CapillaryDB-51478.Silva, Barbosa, et al., 200730. m/0.22 mm/0.25 μm, He, 55. C @ 2. min, 3. K/min, 240. C @ 15. min
CapillaryDB-11489.Sonboli, Azizian, et al., 200760. m/0.25 mm/0.25 μm, N2, 5. K/min, 250. C @ 10. min; Tstart: 60. C
CapillaryDB-51480.Telascrea, de Araujo, et al., 200730. m/0.25 mm/0.25 μm, He, 3. K/min; Tstart: 60. C; Tend: 240. C
CapillaryHP-5MS1484.Vagionas, Ngassapa, et al., 200730. m/0.25 mm/0.25 μm, He, 3. K/min; Tstart: 60. C; Tend: 280. C
CapillaryCP Sil 5 CB1494.Andrianoelisoa H.S., Menut C., et al., 200630. m/0.25 mm/0.25 μm, N2, 5. K/min; Tstart: 50. C; Tend: 200. C
CapillaryHP-5MS1461.Basta, Tzakou, et al., 200630. m/0.25 mm/0.25 μm, He, 3. K/min; Tstart: 60. C; Tend: 280. C
CapillaryDB-51480.Block, Flamini, et al., 200630. m/0.25 mm/0.25 μm, He, 3. K/min; Tstart: 60. C; Tend: 240. C
CapillaryBP-11477.Boti, Bighelli, et al., 200650. m/0.22 mm/0.25 μm, He, 2. K/min, 220. C @ 20. min; Tstart: 60. C
CapillaryHP-5MS1483.Chorianopoulos N., Evergets E., et al., 200630. m/0.25 mm/0.25 μm, He, 3. K/min; Tstart: 60. C; Tend: 280. C
CapillaryDB-51480.Dob, Dahmane, et al., 200630. m/0.32 mm/0.25 μm, N2, 60. C @ 3. min, 3. K/min, 240. C @ 5. min
CapillaryDB-51482.Dob, Dahmane, et al., 2006, 230. m/0.25 mm/0.25 μm, N2, 60. C @ 3. min, 3. K/min, 240. C @ 3. min
CapillaryDB-51480.Esmaeili, Nematollahi, et al., 200650. m/0.2 mm/0.32 μm, N2, 60. C @ 3. min, 5. K/min, 220. C @ 5. min
CapillaryHP-51482.Flamini, Tebano, et al., 200630. m/0.25 mm/0.25 μm, N2, 60. C @ 10. min, 5. K/min; Tend: 220. C
CapillaryBP-11478.Gonny, Cavaleiro, et al., 200650. m/0.22 mm/0.25 μm, He, 2. K/min, 220. C @ 20. min; Tstart: 60. C
CapillaryHP-51485.Javidnia, Miri, et al., 200630. m/0.25 mm/0.25 μm, He, 3. K/min; Tstart: 60. C; Tend: 260. C
CapillaryDB-11481.Kuiate, Bessière, et al., 200630. m/0.25 mm/0.25 μm, N2, 4. K/min; Tstart: 50. C; Tend: 220. C
CapillaryHP-5MS1481.Kukic J., Petrovic S., et al., 200630. m/0.25 mm/0.25 μm, He, 3. K/min; Tstart: 60. C; Tend: 280. C
CapillaryHP-51491.Liu J.M., Nan P., et al., 200630. m/0.25 mm/0.25 μm, He, 60. C @ 2. min, 10. K/min, 250. C @ 10. min
CapillaryDB-51480.Masoudi, Esmaeili, et al., 200650. m/0.2 mm/0.32 μm, N2, 60. C @ 3. min, 5. K/min, 220. C @ 5. min
CapillaryHP-5MS1453.Pavlovic, Kovacevic, et al., 200630. m/0.25 mm/0.25 μm, He, 3. K/min; Tstart: 60. C; Tend: 280. C
CapillaryDB-51472.Pavlovic, Tzakou, et al., 200630. m/0.32 mm/0.25 μm, He, 3. K/min; Tstart: 60. C; Tend: 280. C
CapillaryHP-51493.Perraudin, Popovici, et al., 200660. m/0.25 mm/0.25 μm, He, 3. K/min; Tstart: 60. C; Tend: 250. C
CapillarySPB-11466.Pinto, Pina-Vaz, et al., 200630. m/0.2 mm/0.2 μm, He, 3. K/min, 220. C @ 15. min; Tstart: 70. C
CapillarySPB-11464.Radulovic, Lazarevic, et al., 200630. m/0.25 mm/0.25 μm, He, 50. C @ 3. min, 5. K/min, 250. C @ 15. min
CapillarySPB-11465.Radulovic, Mananjarasoa, et al., 200630. m/0.25 mm/0.25 μm, He, 50. C @ 3. min, 5. K/min, 250. C @ 15. min
CapillaryDB-11480.Rezazadeh, Hamedani, et al., 200630. m/0.25 mm/0.25 μm, He, 4. K/min; Tstart: 60. C; Tend: 240. C
CapillaryHP-51490.Rezazadeh, Hamedani, et al., 200625. m/0.25 mm/0.25 μm, He, 4. K/min; Tstart: 60. C; Tend: 240. C
CapillarySPB-11466.Salgueiro L.R., Pinto E., et al., 200630. m/0.2 mm/0.2 μm, He, 3. K/min, 220. C @ 15. min; Tstart: 70. C
CapillaryHP-5MS1480.Saroglou, Dorizas, et al., 200630. m/0.25 mm/0.25 μm, He, 60. C @ 5. min, 4. K/min; Tend: 280. C
CapillaryHP-5MS1479.Silva-Brandão, Solferini, et al., 200630. m/0.25 mm/0.25 μm, He, 3. K/min; Tstart: 60. C; Tend: 300. C
CapillaryDB-51485.Su, Ho, et al., 200630. m/0.25 mm/0.25 μm, He, 50. C @ 2. min, 5. K/min; Tend: 250. C
CapillaryHP-5MS1481.Vujisic L., Vuckovic I., et al., 200630. m/0.25 mm/0.25 μm, H2, 4.3 K/min; Tstart: 50. C; Tend: 285. C
CapillaryHP-51480.Vundac, Pfeifhofer, et al., 200630. m/0.25 mm/0.25 μm, He, 40. C @ 5. min, 4. K/min; Tend: 300. C
CapillaryCP Sil 5 CB1479.Ziegenbein, Hanssen, et al., 200625. m/0.25 mm/0.4 μm, He, 10. K/min; Tstart: 80. C; Tend: 270. C
CapillaryDB-51460.Agnihotri, Agarwal, et al., 200530. m/0.25 mm/0.25 μm, He, 90. C @ 2. min, 4. K/min; Tend: 220. C
CapillaryDB-11481.Agnaniet, Makani, et al., 200530. m/0.25 mm/0.25 μm, N2, 5. K/min; Tstart: 50. C; Tend: 200. C
CapillarySPB-11464.Boskovic, Radulovic, et al., 200530. m/0.25 mm/0.25 μm, He, 50. C @ 3. min, 5. K/min, 250. C @ 15. min
CapillaryDB-51480.Boskovic, Radulovic, et al., 200530. m/0.2 mm/0.25 μm, He, 50. C @ 3. min, 5. K/min, 250. C @ 15. min
CapillaryBP-11476.Boti J.B., Koukoua G., et al., 200550. m/0.22 mm/0.25 μm, He, 2. K/min, 220. C @ 20. min; Tstart: 60. C
CapillarySE-541486.Brantner, Pfeifhofer, et al., 200550. m/0.25 mm/0.27 μm, H2, 5. K/min; Tstart: 50. C; Tend: 300. C
CapillaryHP-51482.Celik, Gokturk, et al., 200530. m/0.25 mm/0.25 μm, N2, 60. C @ 10. min, 5. K/min; Tend: 220. C
CapillaryHP-51481.Cioni, Flamini, et al., 200530. m/0.25 mm/0.25 μm, N2, 60. C @ 10. min, 5. K/min; Tend: 220. C
CapillaryDB-11480.Dob, Berramdane, et al., 200530. m/0.32 mm/0.25 μm, N2, 50. C @ 3. min, 2. K/min, 260. C @ 5. min
CapillaryDB-11458.Dob, Dahmane, et al., 200530. m/0.32 mm/0.25 μm, 50. C @ 8. min, 2. K/min; Tend: 250. C
CapillaryDB-11471.Fanciullino, Gancel, et al., 200530. m/0.25 mm/0.25 μm, He, 3. K/min, 250. C @ 20. min; Tstart: 40. C
CapillaryHP-51481.Flamini, Luigi Cioni, et al., 200530. m/0.25 mm/0.25 μm, N2, 60. C @ 10. min, 5. K/min; Tend: 220. C
CapillaryHP-51482.Flamini, Luigi Cioni, et al., 2005, 230. m/0.25 mm/0.25 μm, N2, 60. C @ 10. min, 5. K/min; Tend: 220. C
CapillaryDB-11457.Gancel, Ollitrault, et al., 200530. m/0.25 mm/0.25 μm, He, 3. K/min, 250. C @ 20. min; Tstart: 40. C
CapillaryCP Sil 5 CB1466.Idzojtic, Kajba, et al., 200550. m/0.22 mm/0.13 μm, H2, 4. K/min, 300. C @ 10. min; Tstart: 40. C
CapillaryDB-51486.bin Jantan, Yalvema, et al., 200525. m/0.25 mm/0.25 μm, N2, 75. C @ 10. min, 3. K/min, 210. C @ 1. min
CapillaryHP-51484.Javidnia, Miri, et al., 200530. m/0.25 mm/0.25 μm, He, 3. K/min; Tstart: 60. C; Tend: 260. C
CapillaryHP-51480.Javidnia, Miri, et al., 2005, 2He, 3. K/min; Column length: 30. m; Column diameter: 0.25 mm; Tstart: 60. C; Tend: 260. C
CapillaryRTX-11477.Paolini, Costa, et al., 200560. m/0.22 mm/0.25 μm, He, 2. K/min, 230. C @ 35. min; Tstart: 60. C
CapillaryHP-5MS1480.Pino, Mesa, et al., 200530. m/0.25 mm/0.25 μm, He, 60. C @ 2. min, 4. K/min, 250. C @ 20. min
CapillaryDB-51479.Senatore, Napolitano, et al., 200530. m/0.25 mm/0.25 μm, He, 40. C @ 5. min, 2. K/min, 260. C @ 20. min
CapillaryDB-5MS1475.Seo and Baek, 200560. m/0.25 mm/0.25 μm, He, 2. K/min, 200. C @ 20. min; Tstart: 40. C
CapillaryDB-11480.Tchoumbougnang, Zollo, et al., 200530. m/0.25 mm/0.25 μm, N2, 5. K/min; Tstart: 50. C; Tend: 200. C
CapillaryBP-11478.Vellutini, Baldovini, et al., 200550. m/0.22 mm/0.25 μm, He, 2. K/min, 230. C @ 35. min; Tstart: 60. C
CapillaryMega 5MS1466.Verzera, Trozzi, et al., 200530. m/0.25 mm/0.25 μm, He, 40. C @ 2. min, 3. K/min; Tend: 240. C
CapillaryHP-5MS1478.Aligiannis, Kalpoutzakis, et al., 200430. m/0.25 mm/0.25 μm, He, 3. K/min; Tstart: 60. C; Tend: 280. C
CapillarySPB-11467.Antunes, Sevinate-Pinto, et al., 200430. m/0.25 mm/0.25 μm, He, 3. K/min, 220. C @ 15. min; Tstart: 70. C
CapillaryHP-51480.Bertoli, Menichini, et al., 200430. m/0.25 mm/0.25 μm, N2, 60. C @ 10. min, 5. K/min; Tend: 220. C
CapillaryHP-51480.Bertoli, Pistelli, et al., 200430. m/0.25 mm/0.25 μm, N2, 60. C @ 10. min, 5. K/min; Tend: 220. C
CapillarySPB-11466.Cavaleiro, Salgueiro, et al., 200430. m/0.2 mm/0.2 μm, He, 3. K/min, 220. C @ 15. min; Tstart: 70. C
CapillaryHP-51481.Ceccarini, Macchia, et al., 200430. m/0.25 mm/0.25 μm, 60. C @ 10. min, 5. K/min; Tend: 220. C
CapillaryHP-5MS1483.Chorianopoulos, Kalpoutzakis, et al., 200430. m/0.25 mm/0.25 μm, He, 3. K/min; Tstart: 60. C; Tend: 280. C
CapillaryRTX-51484.Dugo, Mondello, et al., 200430. m/0.25 mm/0.25 μm, He, 45. C @ 6. min, 3. K/min, 300. C @ 10. min
CapillaryHP-51482.Flamini, Bader, et al., 200430. m/0.25 mm/0.25 μm, He, 3. K/min; Tstart: 60. C; Tend: 240. C
CapillaryDB-51482.Flamini, Cioni, et al., 200430. m/0.25 mm/0.25 μm, N2, 3. K/min; Tstart: 60. C; Tend: 240. C
CapillaryHP-51480.Flach A., Dondon R.C., et al., 200430. m/0.25 mm/0.25 μm, He, 4. K/min; Tstart: 50. C; Tend: 290. C
CapillaryHP-51482.Flamini, Luigi Cioni, et al., 200430. m/0.25 mm/0.25 μm, N2, 60. C @ 10. min, 5. K/min; Tend: 220. C
CapillaryBP-11479.Gonny, Bradesi, et al., 200450. m/0.22 mm/0.25 μm, 2. K/min, 220. C @ 20. min; Tstart: 60. C
CapillaryHP-5MS1480.Grujic-Jovanovic, Skaltsa, et al., 200430. m/0.25 mm/0.25 μm, He, 60. C @ 5. min, 4. K/min; Tend: 280. C
CapillaryHP-51482.Isidorov, Krajewska, et al., 200430. m/0.25 mm/0.25 μm, He, 3. K/min; Tstart: 40. C; Tend: 250. C
CapillaryHP-51480.Javidnia, Miri, et al., 200430. m/0.25 mm/0.25 μm, He, 3. K/min; Tstart: 60. C; Tend: 260. C
CapillaryHP-51483.Javidnia, Miri, et al., 2004, 2He, 3. K/min; Column length: 30. m; Column diameter: 0.25 mm; Tstart: 60. C; Tend: 260. C
CapillaryHP-5MS1486.Karioti, Hadjipavlou-Litina, et al., 200430. m/0.25 mm/0.25 μm, He, 60. C @ 5. min, 4. K/min; Tend: 280. C
CapillaryDB-5MS1470.Mardarowicz, Wianowska, et al., 200430. m/0.25 mm/0.25 μm, He, 40. C @ 2. min, 4. K/min; Tend: 280. C
CapillarySPB-11467.Moldão-Martins, Beirão-da-Costa, et al., 200430. m/0.2 mm/0.2 μm, He, 3. K/min, 220. C @ 15. min; Tstart: 70. C
CapillaryHP-5MS1490.Mumm, Tiemann, et al., 200430. m/0.25 mm/0.25 μm, He, 50. C @ 5. min, 5. K/min; Tend: 300. C
CapillaryRSL-2001502.Ngassoum, Ousmaila, et al., 200430. m/0.32 mm/0.25 μm, H2, 40. C @ 5. min, 6. K/min, 280. C @ 5. min
CapillaryMethyl Silicone1480.Özcan and Chalchat, 2004He, 3. K/min; Column length: 50. m; Column diameter: 0.25 mm; Tstart: 50. C; Tend: 240. C
CapillaryDB-51480.Reis, Pansarim, et al., 200430. m/0.25 mm/0.25 μm, He, 4. K/min; Tstart: 50. C; Tend: 290. C
CapillaryHP-51482.Sartoratto, Machado, et al., 200425. m/0.2 mm/0.33 μm, He, 3. K/min, 240. C @ 7. min; Tstart: 60. C
CapillaryHP-51482.Stashenko, Jaramillo, et al., 200450. m/0.2 mm/0.2 μm, He, 40. C @ 15. min, 3. K/min, 250. C @ 40. min
CapillaryHP-51480.Stashenko, Jaramillo, et al., 2004, 250. m/0.2 mm/0.2 μm, He, 35. C @ 15. min, 3. K/min, 250. C @ 40. min
CapillaryHP-5MS1464.Tzakou, Vagias, et al., 200430. m/0.25 mm/0.25 μm, He, 3. K/min; Tstart: 60. C; Tend: 280. C
CapillaryOptima 51470.Vérité, Nacer, et al., 200425. m/0.25 mm/0.25 μm, He, 3. K/min, 280. C @ 20. min; Tstart: 60. C
CapillaryDB-5MS1489.Yu, Kim, et al., 200430. m/0.25 mm/0.25 μm, He, 40. C @ 5. min, 4. K/min, 200. C @ 20. min
CapillaryDB-5MS1487.Yu, Kim, et al., 2004, 230. m/0.25 mm/0.25 μm, He, 40. C @ 5. min, 4. K/min, 200. C @ 20. min
CapillaryDB-5MS1482.Zheng, Kim, et al., 200430. m/0.25 mm/0.25 μm, He, 40. C @ 5. min, 4. K/min, 200. C @ 20. min
CapillaryBPX-51480.bin Ahmad and bin Jantan, 200330. m/0.25 mm/0.25 μm, N2, 75. C @ 10. min, 3. K/min, 210. C @ 1. min
CapillaryHP-51482.Angelini, Carpanese, et al., 200330. m/0.25 mm/0.25 μm, N2, 60. C @ 10. min, 5. K/min; Tend: 220. C
CapillaryHP-51482.Angelini, Carpanese, et al., 200330. m/0.25 mm/0.25 μm, N2, 60. C @ 10. min, 5. K/min; Tend: 220. C
CapillaryDB-51481.Bader, Caponi, et al., 200330. m/0.25 mm/0.25 μm, He, 3. K/min, 240. C @ 30. min; Tstart: 60. C
CapillaryDB-51481.Bader, Caponi, et al., 2003, 230. m/0.25 mm/0.25 μm, N2, 60. C @ 10. min, 5. K/min; Tend: 220. C
CapillaryDB-51482.Bader, Flamini, et al., 200330. m/0.25 mm/0.25 μm, He, 3. K/min; Tstart: 60. C; Tend: 240. C
CapillaryDB-11484.Boyom, Assembe, et al., 200330. m/0.25 mm/0.25 μm, N2, 5. K/min, 200. C @ 0. min; Tstart: 50. C
CapillaryDB-11452.Brat, Rega, et al., 200330. m/0.25 mm/0.25 μm, He, 3. K/min, 250. C @ 20. min; Tstart: 40. C
CapillaryHP-51481.Campeol, Flamini, et al., 200330. m/0.25 mm/0.25 μm, N2, 60. C @ 10. min, 5. K/min; Tend: 220. C
CapillaryHP-51481.Campeol, Flamini, et al., 200330. m/0.25 mm/0.25 μm, N2, 60. C @ 10. min, 5. K/min; Tend: 220. C
CapillarySPB-11467.Cavaleiro, Salgueiro, et al., 200330. m/0.2 mm/0.2 μm, He, 3. K/min, 220. C @ 15. min; Tstart: 70. C
CapillaryHP-51482.Dural, Bagci, et al., 200330. m/0.25 mm/0.25 μm, N2, 60. C @ 10. min, 5. K/min; Tend: 220. C
CapillaryHP-51483.Emilio Tomei, Manganelli, et al., 200330. m/0.25 mm/0.25 μm, N2, 60. C @ 10. min, 5. K/min; Tend: 220. C
CapillaryHP-51481.Ertugrul, Dural, et al., 200330. m/0.25 mm/0.25 μm, N2, 60. C @ 10. min, 5. K/min; Tend: 220. C
CapillaryDB-11474.de Feo, Urrunaga Soria, et al., 200330. m/0.25 mm/0.25 μm, He, 40. C @ 5. min, 2. K/min; Tend: 250. C
CapillaryDB-51481.Flamini, Luigi Cioni, et al., 200330. m/0.25 mm/0.25 μm, He, 3. K/min; Tstart: 60. C; Tend: 240. C
CapillaryHP-51483.Flamini, Luigi Cioni, et al., 2003, 230. m/0.25 mm/0.25 μm, N2, 60. C @ 10. min, 5. K/min; Tend: 220. C
CapillaryHP-51481.Flamini, Luigi Cioni, et al., 2003, 330. m/0.25 mm/0.25 μm, N2, 60. C @ 10. min, 5. K/min; Tend: 220. C
CapillaryHP-51482.Flamini, Luigi Cioni, et al., 2003, 430. m/0.25 mm/0.25 μm, N2, 60. C @ 10. min, 5. K/min; Tend: 220. C
CapillaryHP-51480.Fokialakis, Melliou, et al., 200330. m/0.25 mm/0.25 μm, He, 3. K/min; Tstart: 60. C; Tend: 280. C
CapillaryDB-11457.Gancel, Ollitrault, et al., 200330. m/0.25 mm/0.25 μm, He, 3. K/min, 250. C @ 20. min; Tstart: 40. C
CapillaryDB-51499.Högnadóttir and Rouseff, 200330. m/0.32 mm/0.5 μm, 7. K/min, 265. C @ 5. min; Tstart: 40. C
CapillaryDB-51482.Javidnia, Miri, et al., 2003He, 4. K/min; Column length: 25. m; Column diameter: 0.25 mm; Tstart: 60. C; Tend: 260. C
CapillaryHP-51482.Macchioni, Cioni, et al., 200330. m/0.25 mm/0.25 μm, He, 3. K/min; Tstart: 60. C; Tend: 240. C
CapillaryHP-5MS1478.Mimica-Dukic, Kujundzic, et al., 200330. m/0.25 mm/0.25 μm, He, 3. K/min; Tstart: 60. C; Tend: 280. C
CapillaryHP-51480.Ngassapa, Runyoro, et al., 200330. m/0.25 mm/0.25 μm, He, 3. K/min; Tstart: 60. C; Tend: 280. C
CapillaryHP-5MS1480.Salido, Altarejos, et al., 200330. m/0.25 mm/0.25 μm, He, 3. K/min; Tstart: 50. C; Tend: 250. C
CapillaryDB-11458.Senatore, Lentini, et al., 200330. m/0.25 mm/0.25 μm, He, 40. C @ 5. min, 2. K/min, 270. C @ 20. min
CapillaryHP-11480.Senatore, Rigano, et al., 200330. m/0.25 mm/0.33 μm, He, 40. C @ 5. min, 2. K/min, 260. C @ 20. min
CapillaryRTX-51480.Shellie, Marriott, et al., 200330. m/0.25 mm/0.25 μm, He, 45. C @ 6. min, 3. K/min; Tend: 250. C
CapillaryHP-51481.Shellie and Marriott, 200330. m/0.25 mm/0.25 μm, He, 3. K/min; Tstart: 40. C; Tend: 240. C
CapillaryHP-51480.Skaltsa, Demetzos, et al., 200330. m/0.25 mm/0.25 μm, He, 60. C @ 5. min, 4. K/min; Tend: 280. C
CapillaryHP-51485.Tsiri, Kretsi, et al., 200330. m/0.25 mm/0.25 μm, He, 3. K/min; Tstart: 60. C; Tend: 280. C
CapillaryHP-51480.Tzakou, Couladis, et al., 200330. m/0.25 mm/0.25 μm, He, 3. K/min; Tstart: 60. C; Tend: 280. C
CapillaryMega 5MS1466.Verzera, Trozzi, et al., 200330. m/0.25 mm/0.25 μm, He, 40. C @ 2. min, 3. K/min; Tend: 240. C
CapillarySPB-11467.Cavaleiro, Salgueiro, et al., 200230. m/0.20 mm/0.20 μm, He, 3. K/min, 220. C @ 15. min; Tstart: 70. C
CapillaryDB-51476.Choi, Kim. M.-S.L., et al., 200230. m/0.25 mm/0.25 μm, He, 70. C @ 2. min, 4. K/min, 230. C @ 20. min
CapillaryDB-51480.Economakis, Skaltsa, et al., 200230. m/0.25 mm/0.25 μm, 50. C @ 5. min, 3. K/min; Tend: 280. C
CapillaryDB-51481.Flamini, Cioni, et al., 200230. m/0.25 mm/0.25 μm, He, 3. K/min; Tstart: 60. C; Tend: 240. C
CapillaryDB-51482.Flamini, Cioni, et al., 2002, 230. m/0.25 mm/0.25 μm, He, 3. K/min; Tstart: 60. C; Tend: 240. C
CapillaryHP-51482.Flamini, Cioni, et al., 2002, 330. m/0.25 mm/0.25 μm, N2, 60. C @ 10. min, 5. K/min; Tend: 220. C
CapillaryHP-51485.Fokialakis, Magiatis, et al., 200230. m/0.25 mm/0.25 μm, 60. C @ 5. min, 3. K/min; Tend: 280. C
CapillaryCP Sil 5 CB1482.Heinrich, Pfeifhofer, et al., 200250. m/0.25 mm/0.15 μm, H2, 40. C @ 3. min, 4. K/min; Tend: 300. C
CapillaryRTX-5 MS1481.Hudaib, Speroni, et al., 200230. m/0.25 mm/0.25 μm, He, 45. C @ 10. min, 2.5 K/min; Tend: 180. C
CapillaryBP-11480.Lota, de Rocca Serra, et al., 200250. m/0.22 mm/0.25 μm, He, 2. K/min, 220. C @ 20. min; Tstart: 60. C
CapillaryHP-51480.Magiatis, Skaltsounis, et al., 200230. m/0.25 mm/0.25 μm, He, 60. C @ 5. min, 3. K/min; Tend: 280. C
CapillaryDB-51480.Miri, Ramezani, et al., 2002He, 4. K/min; Column length: 25. m; Column diameter: 0.25 mm; Tstart: 70. C; Tend: 260. C
CapillaryRTX-51487.Mondello, Zappia, et al., 200230. m/0.25 mm/0.25 μm, He, 45. C @ 6. min, 3. K/min, 300. C @ 10. min
CapillaryHP-11470.Nath, Sarma, et al., 200224. m/0.32 mm/0.17 μm, He, 60. C @ 2. min, 4. K/min, 250. C @ 20. min
CapillaryCP Sil 5 CB1476.Pino, Marbot, et al., 200250. m/0.32 mm/0.4 μm, He, 60. C @ 10. min, 3. K/min, 280. C @ 60. min
CapillaryHP-51451.Pitarokili, Couladis, et al., 200230. m/0.25 mm/0.25 μm, He, 3. K/min; Tstart: 60. C; Tend: 280. C
CapillaryHP-5MS1484.Shang, Hu, et al., 200230. m/0.25 mm/0.25 μm, He, 50. C @ 2. min, 5. K/min, 250. C @ 5. min
CapillaryRTX-51464.Shellie, Mondello, et al., 200230. m/0.25 mm/0.25 μm, He, 45. C @ 6. min, 3. K/min; Tend: 250. C
CapillaryHP-51480.Aligiannis, Kalpoutzakis, et al., 200130. m/0.25 mm/0.25 μm, He, 60. C @ 5. min, 3. K/min; Tend: 280. C
CapillaryHP-51481.Couladis, Baziou, et al., 200130. m/0.25 mm/0.25 μm, He, 3. K/min, 260. C @ 10. min; Tstart: 60. C
CapillaryHP-51473.Couladis, Tsortanidou, et al., 200130. m/0.25 mm/0.25 μm, He, 3. K/min; Tstart: 60. C; Tend: 380. C
CapillaryHP-51480.Couladis, Tzakou, et al., 200130. m/0.25 mm/0.50 μm, He, 3. K/min; Tstart: 60. C; Tend: 280. C
CapillaryHP-11485.Guilliard, Delgado, et al., 200160. m/0.25 mm/0.25 μm, He, 50. C @ 5. min, 2.5 K/min; Tend: 250. C
CapillaryHP-51480.Guilliard, Delgado, et al., 200150. m/0.25 mm/0.25 μm, He, 50. C @ 5. min, 2.5 K/min; Tend: 250. C
CapillaryRTX-5 MS1484.Hudaib, Grazia Bellardi, et al., 200130. m/0.25 mm/0.25 μm, He, 70. C @ 10. min, 4. K/min, 210. C @ 10. min
CapillaryRTX-5 MS1484.Hudaib, Grazia Bellardi, et al., 200130. m/0.25 mm/0.25 μm, He, 70. C @ 10. min, 4. K/min, 210. C @ 10. min
CapillaryDB-51482.Isidorov, Zenkevich, et al., 2001He, 3. K/min; Column length: 30. m; Column diameter: 0.25 mm; Tstart: 50. C; Tend: 250. C
CapillaryBP-11480.Lota, Serra, et al., 200150. m/0.22 mm/0.25 μm, He, 2. K/min; Tstart: 60. C; Tend: 220. C
CapillaryDB-51482.Nogueira, Bittrich, et al., 200130. m/0.25 mm/0.25 μm, H2, 3. K/min; Tstart: 60. C; Tend: 240. C
CapillaryCP Sil 5 CB1476.Pino, Marbot, et al., 200150. m/0.32 mm/0.4 μm, He, 60. C @ 10. min, 3. K/min, 280. C @ 60. min
CapillaryBP-11481.Rezzi, Bighelli, et al., 200150. m/0.22 mm/0.25 μm, He, 2. K/min, 220. C @ 20. min; Tstart: 60. C
CapillaryBP-11478.Rezzi, Cavaleiro, et al., 200150. m/0.22 mm/0.25 μm, 2. K/min, 220. C @ 20. min; Tstart: 60. C
CapillaryHP-5MS1480.Skaltsa, Mavrommati, et al., 200130. m/0.25 mm/0.25 μm, He, 60. C @ 5. min, 4. K/min; Tend: 280. C
CapillaryBPX-51504.Zabaras and Wyllie, 200150. m/0.22 mm/0.25 μm, H2, 60. C @ 5. min, 4. K/min, 180. C @ 5. min
CapillaryBP-11480.Baldovini, Ristorcelli, et al., 200050. m/0.22 mm/0.25 μm, 2. K/min, 220. C @ 20. min; Tstart: 60. C
CapillaryDB-51479.Bartley and Jacobs, 200060. m/0.25 mm/0.25 μm, He, 40. C @ 2. min, 4. K/min, 290. C @ 5. min
CapillaryHP-51473.Kim, Thuy, et al., 200030. m/0.25 mm/0.25 μm, He, 40. C @ 5. min, 2. K/min, 200. C @ 20. min
CapillaryHP-51478.Lazari, Skaltsa, et al., 200030. m/0.25 mm/0.25 μm, He, 50. C @ 5. min, 4. K/min; Tend: 280. C
CapillaryBP-11478.Lota, de Rocca Serra, et al., 200050. m/0.22 mm/0.25 μm, He, 2. K/min, 230. C @ 35. min; Tstart: 60. C
CapillaryBP-11480.Lota, de Rocca Serra, et al., 200050. m/0.22 mm/0.25 μm, He, 2. K/min, 230. C @ 35. min; Tstart: 60. C
CapillaryDB-51480.Maia, de Paula, et al., 200030. m/0.25 mm/0.25 μm, He, 60. C @ 2. min, 3. K/min; Tend: 240. C
CapillaryDB-51480.Maia, de Paula, et al., 200030. m/0.25 mm/0.25 μm, He, 60. C @ 2. min, 3. K/min; Tend: 240. C
CapillaryDB-51481.Maia, de Paula, et al., 200030. m/0.25 mm/0.25 μm, He, 60. C @ 2. min, 3. K/min; Tend: 240. C
CapillaryDB-51481.Maia, de Paula, et al., 200030. m/0.25 mm/0.25 μm, He, 60. C @ 2. min, 3. K/min; Tend: 240. C
CapillaryRTX-51489.Mondello, Zappia, et al., 200010. m/0.1 mm/0.1 μm, He, 12.3 K/min; Tstart: 50. C; Tend: 350. C
CapillaryCP Sil 5 CB1493.Pfeifhofer, 200050. m/0.22 mm/0.13 μm, H2, 4. K/min, 300. C @ 10. min; Tstart: 40. C
CapillaryHP-51480.Skaltsa, Lazari, et al., 200030. m/0.25 mm/0.25 μm, He, 50. C @ 5. min, 4. K/min; Tend: 280. C
CapillaryHP-51485.Song, Sawamura, et al., 200030. m/0.25 mm/0.25 μm, He, 2. K/min; Tstart: 70. C; Tend: 230. C
CapillaryDB-51485.Song, Sawamura, et al., 2000, 230. m/0.25 mm/0.25 μm, N2, 2. K/min; Tstart: 70. C; Tend: 230. C
CapillaryMega 5MS1466.Verzera, la Rosa, et al., 200030. m/0.25 mm/0.25 μm, He, 40. C @ 2. min, 3. K/min; Tend: 240. C
CapillaryMega 5MS1466.Verzera, Trozzi, et al., 200030. m/0.25 mm/0.25 μm, He, 40. C @ 2. min, 3. K/min; Tend: 240. C
CapillaryCBP-11480.Zunino, Lopez, et al., 2000He, 4. K/min; Column length: 30. m; Column diameter: 0.25 mm; Tstart: 60. C; Tend: 240. C
CapillaryHP-51480.Lazari, Skaltsa, et al., 199930. m/0.25 mm/0.25 μm, He, 50. C @ 5. min, 4. K/min; Tend: 280. C
CapillaryBP-11480.Lota, Serra, et al., 199950. m/0.22 mm/0.25 μm, He, 2. K/min, 230. C @ 35. min; Tstart: 60. C
CapillaryOV-1011483.Menut, Bessiere, et al., 1999N2, 5. K/min; Column length: 25. m; Column diameter: 0.25 mm; Tstart: 50. C; Tend: 200. C
CapillaryDB-11489.Mirza and Sefidkon, 199960. m/0.25 mm/0.25 μm, He, 4. K/min; Tstart: 50. C; Tend: 220. C
CapillaryHP-11473.Stashenko, Cervantes, et al., 199960. m/0.25 mm/0.25 μm, He, 50. C @ 5. min, 2.5 K/min; Tend: 250. C
CapillaryMethyl Silicone1481.Sumathykutty, Rao, et al., 199950. m/0.25 mm/0.17 μm, N2, 2. K/min; Tstart: 80. C; Tend: 200. C
CapillaryOV-11458.Bicchi, Rubiolo, et al., 199825. m/0.25 mm/0.3 μm, 50. C @ 1. min, 3. K/min, 200. C @ 20. min
CapillaryDB-51489.Isidorov, Zenkevich, et al., 199830. m/0.25 mm/0.25 μm, 3. K/min; Tstart: 50. C; Tend: 250. C
CapillaryDB-51481.Nogueira, Marsaioli, et al., 199830. m/0.25 mm/0.25 μm, H2, 3. K/min; Tstart: 60. C; Tend: 240. C
CapillaryHP-51479.Oprean, Tamas, et al., 1998He, 3. K/min; Column diameter: 0.26 mm; Phase thickness: 0.25 μm; Tstart: 60. C; Tend: 240. C
CapillaryBP-11483.Tam, An, et al., 199850. m/0.22 mm/0.25 μm, He, 2. K/min, 220. C @ 20. min; Tstart: 60. C
CapillaryOV-11457.Bicchi, Fresia, et al., 199725. m/0.25 mm/0.3 μm, H2, 50. C @ 1. min, 3. K/min, 200. C @ 20. min
CapillaryDB-51478.Sagrero-Nieves, Bartley, et al., 199730. m/0.26 mm/0.25 μm, He, 2. K/min, 225. C @ 20. min; Tstart: 50. C
CapillaryDB-11485.Stashenko, Prada, et al., 199660. m/0.25 mm/0.25 μm, He, 50. C @ 5. min, 3.5 K/min; Tend: 250. C
CapillaryMethyl Silicone1493.Píry, Príbela, et al., 199525. m/0.2 mm/0.3 μm, He, 2. K/min; Tstart: 40. C; Tend: 200. C
CapillaryDB-11468.Stashenko, Wiame, et al., 199530. m/0.20 mm/0.20 μm, He, 70. C @ 5. min, 4. K/min; Tend: 200. C
CapillaryHP-1011500.Chung, Eiserich, et al., 1993N2, 3. K/min; Column length: 50. m; Column diameter: 0.25 mm; Tstart: 70. C; Tend: 200. C
CapillaryDB-11473.Flath, Light, et al., 199050. C @ 0.1 min, 4. K/min; Column length: 60. m; Column diameter: 0.32 mm; Tend: 250. C
CapillaryDB-51500.Le Quere and Latrasse, 199060. m/0.32 mm/1. μm, He, 3. K/min; Tstart: 40. C; Tend: 220. C

Van Den Dool and Kratz RI, non-polar column, custom temperature program

View large format table.

Column type Active phase I Reference Comment
CapillaryDB-51485.Andrade, Sampaio, et al., 200730. m/0.25 mm/0.25 μm, He; Program: 40C(2min) => 4C/min => 220C => 20C/min => 280C
CapillaryBPX-51490.Dharmawan, Kasapis, et al., 200730. m/0.25 mm/0.25 μm, He; Program: 35C => 4C/min => 200C => 30C/min => 300C (3min)
CapillaryBP-51481.Sant'Anna, Fontes, et al., 200725. m/0.22 mm/0.25 μm, He; Program: 30C(1min) => 50C/min => 105C => 1.5C/min => 150C => 30C/min => 280C (10min)
CapillaryCBP-51483.Silva, Oliveira, et al., 200730. m/0.25 mm/0.25 μm, He; Program: 60C => 3C/min => 246C => 10C/min => 270C (5min)
CapillaryBPX-51496.Cardeal, da Silva, et al., 200630. m/0.25 mm/0.25 μm; Program: 35C(5min) => 3C/min => 210C => 40C/min => 240C (4min)
CapillaryDB-5MS1496.Eom S.H., Yang H.S., et al., 200630. m/0.25 mm/0.25 μm, He; Program: 50C(3min) => 200C(2min) => 15C/min => 300C(5min)
CapillarySE-521485.Guerrini, Sacchetti, et al., 200630. m/0.32 mm/0.15 μm, He; Program: 45C => 1C/min => 100C => 5C/min => 250C (10min)
CapillaryDB-51482.Özel, Gögüs, et al., 2006Program: not specified
CapillarySE-521485.Sacchetti, Guerrini, et al., 200630. m/0.32 mm/0.15 μm, He; Program: 45C => 1C/min => 100C => 5C/min => 250C(10min)
CapillarySE-521487.Bruni, Pellati, et al., 200530. m/0.32 mm/0.15 μm, He; Program: 45C => 1C/min => 100C => 5C/min => 250C(10min)
CapillarySE-521475.Lorenzo, Paz, et al., 200525. m/0.32 mm/0.43 μm, H2; Program: 60C(8min) => 3C/min => 180C => 20C/min => 250C(10min)
CapillaryCBP-51479.Oliveira, Campos, et al., 200530. m/0.25 mm/0.25 μm, He; Program: 60C => 3C/min => 240C => 10C/min => 280C(10min)
CapillaryDB-5MS1480.Zheng, Kim, et al., 200530. m/0.25 mm/0.25 μm, He; Program: 40 (5min) => 4C/min => 140C => 4C/min => 200C (20min)
CapillarySE-521470.Frizzo, Lorenzo, et al., 200425. m/0.32 mm/0.43 μm, H2; Program: 60C(8min) => 3C/min => 180C => 20C/min => 250C(10min)
CapillarySE-521485.Lorenzo, Paz, et al., 200425. m/0.32 mm/0.4 μm; Program: 60C(8min) => 3C/min => 180C => 20C/min => 250C(10min)
CapillarySE-521465.Sacchetti, Medici, et al., 200430. m/0.52 mm/0.15 μm, He; Program: 45C => 1C/min => 100C => 5C/min => 250C (10min)
CapillaryDB-5MS1486.Kim, Lee, et al., 200330. m/0.25 mm/0.25 μm, He; Program: 40C(5min) => 4C/min => 160C => 8C/min => 240C (15min)
CapillarySE-521477.Lorenzo, Loayza, et al., 200325. m/0.25 mm/0.25 μm, He; Program: 60C(8min) => 3C/min => 180C => 20C/min => 230C
CapillaryCP Sil 8 CB1480.Mockute and Judzentiene, 2003He; Column length: 50. m; Column diameter: 0.32 mm; Program: 60C (2min) => 5C/min => 160C (1min) => 10C/min => 250C (2min)
CapillaryCBP-51475.Azevedo, Campos, et al., 200250. m/0.25 mm/0.25 μm, He; Program: 60C(2min) => 3C/min => 240C => 10C/min => 280C(10min)
CapillarySE-521481.Lorenzo, Loayza, et al., 200225. m/0.32 mm/0.40 μm, H2; Program: 60 C (8 min) 3 C/min -> 180 C 20 C/min -> 250 C (10 min)
CapillarySE-521479.Lorenzo, Paz, et al., 200230. m/0.32 mm/0.42 μm, H2; Program: 60C(8min) => 3C/min => 180C => 20C/min => 250C(10min)
CapillaryBP-11479.Cavalli, Ranarivelo, et al., 200150. m/0.22 mm/0.25 μm; Program: not specified
CapillarySE-521481.Lorenzo, Paz, et al., 200130. m/0.32 mm/0.40 μm, H2; Program: 60 0C (8 min) 3 K/min -> 180 0C 20 K/min -> 250 0C (10 min)
CapillarySE-521481.Lorenzo, Saavedra, et al., 200125. m/0.25 mm/0.25 μm, He; Program: 60 0C (8 min) 3 K/min -> 180 0C 20 K/min -> 230 0C
CapillaryBP-11478.Filippini, Tomi, et al., 2000Program: not specified
CapillaryHP-51482.Isidorov, Krajewska, et al., 200030. m/0.25 mm/0.25 μm; Program: 40C(1min) => 3C/min => 120C => 5C/min => 280C
CapillarySE-521477.Lorenzo, Dellacassa, et al., 200025. m/0.25 mm/0.25 μm, He; Program: 60C(8min) => 3C/min => 180C => 20C/min => 230C
CapillarySE-521484.Loayza, de Groot, et al., 199925. m/0.25 mm/0.25 μm, He; Program: 60 0C (8 min) 3 K/min -> 180 0C 20 K/min -> 230 0C

Normal alkane RI, non-polar column, temperature ramp

View large format table.

Column type Active phase I Reference Comment
CapillaryRTX-5 MS1485.Pinheiro, de Queiros, et al., 2013Helium, 3. K/min; Column length: 30. m; Column diameter: 0.25 mm; Tstart: 60. C; Tend: 240. C
CapillaryDB-51482.Rodriques, Amorim, et al., 201330. m/0.25 mm/0.25 μm, Helium, 3. K/min; Tstart: 60. C; Tend: 240. C
CapillaryRTX-11479.Bendiabdellah, El Amine Dib, et al., 201260. m/0.22 mm/0.25 μm, Helium, 2. K/min, 230. C @ 5. min; Tstart: 60. C
CapillaryRTX-11479.Bendiabdellah, El Amine Dib, et al., 201260. m/0.22 mm/0.25 μm, Helium, 2. K/min, 230. C @ 5. min; Tstart: 60. C
CapillaryDB-51486.Boukhris, Bouaziz, et al., 201230. m/0.25 mm/0.25 μm, Helium, 100. C @ 1. min, 10. K/min, 260. C @ 10. min
CapillaryMega-51479.Dell'Agli, Sanna, et al., 201225. m/0.25 mm/0.25 μm, Helium, 50. C @ 1. min, 3. K/min, 220. C @ 5. min
CapillaryHP-5 MS1475.Dutra, Pittella, et al., 201230. m/0.25 mm/0.25 μm, Helium, 80. C @ 3. min, 4. K/min, 240. C @ 10. min
CapillaryHP-5 MS1486.Jian-Yu, Zhu, et al., 201230. m/0.25 mm/0.25 μm, Helium, 40. C @ 1. min, 3. K/min, 250. C @ 3. min
CapillaryHP-5 MS1486.Zouari, Ayadi, et al., 201230. m/0.25 mm/0.25 μm, Helium, 50. C @ 1. min, 7. K/min, 250. C @ 5. min
CapillaryCP-Sil 5 CB1490.Ameen, Usman, et al., 201125. m/0.25 mm/0.15 μm, Helium; Tstart: 50. C; Tend: 220. C
CapillaryHP-51485.Bertoli, Lepnardi, et al., 201130. m/0.25 mm/0.25 μm, Helium, 3. K/min; Tstart: 60. C; Tend: 240. C
CapillaryHP-5 MS1472.Hammami, Kamoun, et al., 201130. m/0.25 mm/0.25 μm, Helium, 2. K/min; Tstart: 50. C; Tend: 180. C
CapillaryDB-51480.Karimi, Farmani, et al., 201130. m/0.25 mm/0.25 μm, Helium, 3. K/min; Tstart: 60. C; Tend: 240. C
CapillaryVF-5 MS1485.Leffingwell and Alford, 201160. m/0.32 mm/0.25 μm, Helium, 2. K/min, 260. C @ 28. min; Tstart: 30. C
CapillaryVF-5 MS1485.Leffingwell and Alford, 201160. m/0.32 mm/0.25 μm, Helium, 2. K/min, 260. C @ 28. min; Tstart: 30. C
CapillarySE-30 MS1474.Menichini, Tundis, et al., 201130. m/0.25 mm/0.25 μm, Helium, 50. C @ 5. min, 5. K/min, 250. C @ 10. min
CapillaryCP-Sil 5 CB1482.Mothana, Hasson, et al., 201130. m/0.25 mm/0.26 μm, Nitrogen, 3. K/min, 280. C @ 22. min; Tstart: 45. C
CapillaryMethylsiloxane + 5 % Ph-groups1465.Nadim, Malik, et al., 201130. m/0.25 mm/0.25 μm, Helium, 60. C @ 2. min, 7. K/min, 230. C @ 20. min
CapillaryDB-51475.Pattiram, Lasekan, et al., 201130. m/0.32 mm/0.25 μm, Helium, 2. K/min; Tstart: 35. C; Tend: 200. C
CapillaryRTX-51479.Prasad, Moulekhi, et al., 201130. m/0.32 mm/0.25 μm, Nitrogen, 3. K/min; Tstart: 60. C; Tend: 210. C
CapillaryZB-51494.Vazques, Aimar, et al., 201130. m/0.25 mm/0.25 μm, Nitrogen, 40. C @ 5. min, 5. K/min; Tend: 200. C
CapillaryZB-51494.Vazquez, Demmel, et al., 201130. m/0.25 mm/0.25 μm, Nitrogen, 40. C @ 5. min, 5. K/min, 200. C @ 5. min
CapillaryDB-51487.Yousefzadi, Heidari, et al., 2011Nitrogen, 60. C @ 1. min, 4. K/min, 250. C @ 10. min; Column length: 30. m; Column diameter: 0.25 mm
CapillaryHP-5 MS1521.Zarai, Kadri, et al., 201130. m/0.25 mm/0.25 μm, Helium, 30. C @ 3. min, 5. K/min, 250. C @ 10. min
CapillaryHP-51480.Abderrahim, Belhamel, et al., 201030. m/0.25 mm/0.25 μm, Hydrogen, 50. C @ 5. min, 5. K/min, 250. C @ 5. min
CapillaryHP-51480.Bi Kouame, Bedi, et al., 201030. m/0.25 mm/0.25 μm, Helium, 50. C @ 5. min, 50. K/min, 300. C @ 5. min
CapillaryRTx-11479.Dib, Bendahou, et al., 201060. m/0.22 mm/0.25 μm, Helium, 2. K/min, 230. C @ 35. min; Tstart: 60. C
CapillaryRTX-11479.Dib, Djabou, et al., 201060. m/0.22 mm/0.25 μm, Helium, 2. K/min, 230. C @ 30. min; Tstart: 60. C
CapillaryDB-51485.Ho, Wang, et al., 201030. m/0.25 mm/0.25 μm, Helium, 2. K/min; Tstart: 50. C; Tend: 250. C
CapillaryHP-51484.Kahriman, Tosun, et al., 201030. m/0.32 mm/0.25 μm, Helium, 60. C @ 2. min, 3. K/min; Tend: 240. C
CapillarySPB-11464.Lazarevic, Palic, et al., 201030. m/0.25 mm/0.25 μm, Helium, 50. C @ 3. min, 5. K/min, 250. C @ 15. min
CapillaryHP-5 MS1489.Lazarevic, Radulovic, et al., 201030. m/0.25 mm/0.25 μm, Helium, 5. K/min; Tstart: 70. C; Tend: 290. C
CapillaryDB-5 MS1482.Mesa-Arango, Betancur-Galvis, et al., 201060. m/0.25 mm/0.25 μm, Helium, 40. C @ 15. min, 5. K/min, 250. C @ 15. min
CapillaryDB-11484.Mirjalili, Salehi, et al., 201025. m/0.25 mm/0.25 μm, Nitrogen, 60. C @ 1. min, 4. K/min, 250. C @ 10. min
CapillaryHP-51491.Miyazawa, Kawauchi, et al., 201030. m/0.25 mm/0.25 μm, Helium, 4. K/min, 260. C @ 5. min; Tstart: 40. C
CapillaryHP-51481.Monsef-Esfahani, Miri, et al., 201030. m/0.25 mm/0.25 μm, Helium, 50. C @ 5. min, 3. K/min; Tend: 240. C
CapillaryHP-5 MS1482.Ogunwande, Flamini, et al., 201030. m/0.25 mm/0.25 μm, Helium, 60. C @ 10. min, 5. K/min; Tend: 220. C
CapillaryHP-5 MS1483.Ogunwande, Flamini, et al., 201030. m/0.25 mm/0.25 μm, Helium, 60. C @ 10. min, 5. K/min; Tend: 220. C
CapillaryHP-5 MS1488.Radulovic, Blagojevic, et al., 201030. m/0.25 mm/0.25 μm, Helium, 5. K/min, 290. C @ 10. min; Tstart: 70. C
CapillaryHP-51498.Radulovic, Dordevic, et al., 201030. m/0.25 mm/0.25 μm, Hydrogen, 5. K/min; Tstart: 70. C; Tend: 290. C
CapillaryHP-5 MS1486.Radulovic, Dordevic, et al., 2010, 230. m/0.25 mm/0.25 μm, Helium, 5. K/min, 290. C @ 10. min; Tstart: 70. C
CapillarySLB-5 MS1485.Scandinaro, Tranchida, et al., 201010. m/0.10 mm/0.10 μm, Helium, 10. K/min; Tstart: 50. C; Tend: 250. C
CapillaryDB-51478.Scherer, Wagner, et al., 201030. m/0.25 mm/0.25 μm, Helium, 3. K/min; Tstart: 60. C; Tend: 240. C
CapillaryDB-5 MS1478.Silva, Pott, et al., 201030. m/0.25 mm/0.25 μm, Helium, 3. K/min; Tstart: 60. C; Tend: 240. C
CapillaryCP Sil 5 CB1479.Usman, Zubair, et al., 201025. m/0.25 mm/0.15 μm, 3. K/min; Tstart: 50. C; Tend: 230. C
CapillaryDB-11459.Xu, Tang, et al., 201030. m/0.25 mm/0.25 μm, Helium, 50. C @ 2. min, 4. K/min, 220. C @ 2. min
CapillaryDB-11475.Xu, Tang, et al., 201030. m/0.25 mm/0.25 μm, Helium, 50. C @ 2. min, 4. K/min, 220. C @ 2. min
CapillaryHP-5MS1491.Zouari, Zouari, et al., 201030. m/0.25 mm/0.25 μm, Helium, 50. C @ 1. min, 7. K/min, 250. C @ 5. min
CapillaryZB-51503.Alagarmalai, Nestel, et al., 200930. m/0.25 mm/0.25 μm, Helium, 60. C @ 2. min, 10. K/min, 230. C @ 10. min
CapillaryDB-51485.Alim, Goze, et al., 200930. m/0.25 mm/0.25 μm, Helium, 3. K/min; Tstart: 60. C; Tend: 240. C
CapillaryOV-1011480.Benites, Moiteiro, et al., 200950. m/0.25 mm/0.25 μm, Helium, 2. K/min; Tstart: 70. C; Tend: 220. C
CapillaryOV-1011484.Benites, Moiteiro, et al., 200950. m/0.25 mm/0.25 μm, Helium, 2. K/min; Tstart: 70. C; Tend: 220. C
CapillaryOV-1011486.Benites, Moiteiro, et al., 200950. m/0.25 mm/0.25 μm, Helium, 2. K/min; Tstart: 70. C; Tend: 220. C
CapillaryOV-1011487.Benites, Moiteiro, et al., 200950. m/0.25 mm/0.25 μm, Helium, 2. K/min; Tstart: 70. C; Tend: 220. C
CapillarySE-541474.Dayisoylu and Alma, 200930. m/0.25 mm/0.25 μm, Helium, 60. C @ 5. min, 2. K/min, 260. C @ 999. min
CapillaryHP-5 MS1497.Farhat, Ginies, et al., 200930. m/0.25 mm/0.25 μm, Helium, 60. C @ 8. min, 2. K/min, 250. C @ 15. min
CapillarySPB-51497.Gilani, Shah, et al., 200930. m/0.53 mm/0.50 μm, Nitrogen, 50. C @ 5. min, 3. K/min, 210. C @ 45. min
CapillaryDB-51485.Ho, Wang, et al., 200930. m/0.25 mm/0.25 μm, Helium, 50. C @ 2. min, 5. K/min; Tend: 250. C
CapillaryHP-5 MS1500.Karlsson, Birgersson, et al., 200930. m/0.25 mm/0.25 μm, Hydrogen, 30. C @ 5. min, 8. K/min, 230. C @ 10. min
CapillaryDB-51480.Kazemi and Akhavani, 200950. m/0.20 mm/0.32 μm, Nitrogen, 60. C @ 3. min, 5. K/min; Tend: 220. C
CapillaryHP-5 MS1475.Kim and Chung, 200930. m/0.25 mm/0.25 μm, Helium, 35. C @ 5. min, 2. K/min, 195. C @ 30. min
CapillaryDB-5 MS1520.Koba, Sanda, et al., 200930. m/0.25 mm/0.25 μm, Helium, 50. C @ 5. min, 2. K/min; Tend: 250. C
CapillaryHP-51482.Maridass, 200925. m/0.20 mm/0.33 μm, Helium, 3. K/min, 240. C @ 7. min; Tstart: 60. C
CapillaryRTX-11479.Museli, Pau, et al., 200960. m/0.22 mm/0.25 μm, Helium, 2. K/min, 230. C @ 30. min; Tstart: 60. C
CapillaryRTX-11480.Museli, Pau, et al., 200960. m/0.22 mm/0.25 μm, Helium, 2. K/min, 230. C @ 30. min; Tstart: 60. C
CapillaryDB-51485.Porto, Decorti, et al., 200930. m/0.25 mm/0.25 μm, Helium, 45. C @ 3. min, 3. K/min, 250. C @ 5. min
CapillaryDB-51486.Rahimi-Nasrabadi, Gholivand, et al., 200930. m/0.25 mm/0.25 μm, Nitrogen, 40. C @ 1. min, 3. K/min, 250. C @ 10. min
CapillaryDB-51485.Scrivanti, Anton, et al., 200930. m/0.25 mm/0.25 μm, Nitrogen, 2. K/min; Tstart: 40. C; Tend: 230. C
CapillaryDB-51485.Shafaghat and Sadeghi, 200950. m/0.20 mm/0.32 μm, Nitrogen, 60. C @ 3. min, 5. K/min, 220. C @ 5. min
CapillaryDB-5 MS1474.Shimizu, Imayoshi, et al., 200930. m/0.25 mm/0.25 μm, Helium, 50. C @ 2. min, 3. K/min, 220. C @ 70. min
CapillaryDB-5 MS1489.Su, Wang, et al., 200930. m/0.25 mm/0.25 μm, Helium, 40. C @ 2. min, 4. K/min, 250. C @ 2. min
CapillaryHP-5MS1480.Wannes, Mhamdi, et al., 200930. m/0.25 mm/0.25 μm, Helium, 5. K/min; Tstart: 50. C; Tend: 240. C
CapillaryHP-5 MS1448.Zhao, Zeng, et al., 200930. m/0.25 mm/0.25 μm, Helium, 4. K/min; Tstart: 50. C; Tend: 280. C
CapillaryHP-51470.Aicha, Ines, et al., 200830. m/0.25 mm/0.25 μm, Helium, 50. C @ 3. min, 9. K/min, 280. C @ 3. min
CapillaryHP-5 MS1481.Baziou, Couladis, et al., 20083. K/min; Column length: 30. m; Column diameter: 0.25 mm; Tstart: 60. C; Tend: 280. C
CapillaryUltra 21480.Byun and Shin, 200850. m/0.20 mm/0.11 μm, Helium, 60. C @ 5. min, 2. K/min, 230. C @ 30. min
CapillaryDB-51488.Chieng, Assim, et al., 200825. m/0.22 mm/0.25 μm, Nitrogen, 50. C @ 2. min, 6.5 K/min, 300. C @ 7. min
CapillarySE-521489.Djarri, Medjroubi, et al., 200850. m/0.25 mm/0.25 μm, Helium, 3. K/min, 280. C @ 20. min; Tstart: 60. C
CapillaryHP-51477.Isidorov, Lech, et al., 200830. m/0.25 mm/0.25 μm, Helium, 3. K/min, 300. C @ 30. min; Tstart: 50. C
CapillaryDB-51459.Khokra, Prakash, et al., 200830. m/0.25 mm/0.25 μm, Helium, 100. C @ 2. min, 20. K/min, 300. C @ 10. min
CapillaryVF-5MS1488.Kowalski, 200830. m/0.25 mm/0.25 μm, Helium, 240. C @ 1. min, 20. K/min; Tend: 320. C
CapillaryHP-51480.Lago, Romoff, et al., 200830. m/0.32 mm/0.25 μm, Helium, 100. C @ 2. min, 5. K/min, 240. C @ 5. min
CapillarySLB-5 MS1478.Lo Presti, Sciarrone, et al., 200830. m/0.25 mm/0.25 μm, Helium, 50. C @ 2. min, 3. K/min, 250. C @ 10. min
CapillaryRTX-11477.Paolini, Tomi, et al., 200860. m/0.22 mm/0.25 μm, He, 2. K/min, 230. C @ 35. min; Tstart: 60. C
CapillaryElite-11475.Raj, Baby, et al., 200830. m/0.32 mm/0.25 μm, Helium, 3. K/min; Tstart: 60. C; Tend: 246. C
CapillaryHP-5 MS1479.Sahraoui, Vian, et al., 200830. m/0.25 mm/0.25 μm, Helium, 60. C @ 8. min, 2. K/min, 250. C @ 15. min
CapillaryHP-51488.Saidana, Mahjoub, et al., 200830. m/0.25 mm/0.25 μm, Nitrogen, 50. C @ 1. min, 5. K/min, 280. C @ 1. min
CapillaryHP-5 MS1518.Sarikurkcu, Tepe, et al., 200830. m/0.25 mm/0.25 μm, Helium, 3. K/min; Tstart: 50. C; Tend: 240. C
CapillaryBPX-51483.Shellie, 20087.5 m/0.10 mm/10. μm, Helium, 3. K/min; Tstart: 60. C; Tend: 240. C
CapillaryRTX-51497.Skalicka-Wozniak, Los, et al., 200820. m/0.18 mm/0.20 μm, Helium, 50. C @ 1. min, 4. K/min; Tend: 280. C
CapillaryHP-51481.Yassa and Akhani, 200830. m/0.25 mm/0.32 μm, Helium, 60. C @ 30. min, 5. K/min; Tend: 250. C
CapillaryDB-51478.Amiri, 200750. m/0.20 mm/0.32 μm, Nitrogen, 60. C @ 3. min, 5. K/min, 220. C @ 5. min
CapillaryDB-5MS1482.Andrade, Oliveira, et al., 200730. m/0.25 mm/0.25 μm, He, 3. K/min; Tstart: 60. C; Tend: 240. C
CapillaryHP-5MS1493.Argyropoulou, Daferera, et al., 200730. m/0.25 mm/0.25 μm, He, 3. K/min; Tstart: 60. C; Tend: 240. C
CapillaryCP Sil 5 CB1479.Baran, von Reuss, et al., 200730. m/0.32 mm/0.25 μm, N2, 4. K/min; Tstart: 60. C; Tend: 300. C
CapillaryHP-5MS1470.Basta, Pavlovic, et al., 200730. m/0.25 mm/0.25 μm, He, 3. K/min; Tstart: 60. C; Tend: 280. C
CapillaryDB-51482.Bos, Woerdenbag, et al., 200730. m/0.26 mm/0.25 μm, He, 3. K/min; Tstart: 60. C; Tend: 240. C
CapillaryHP-5MS1473.Calyecac-cortero, Cibrian-Tovar, et al., 200730. m/0.32 mm/0.25 μm, N2, 50. C @ 1. min, 1. K/min; Tend: 200. C
CapillaryHP-5 MS1476.Capetanos, Saroglou, et al., 200730. m/0.32 mm/0.25 μm, Helium, 60. C @ 5. min, 4. K/min; Tend: 280. C
CapillaryHP-51480.Cheraif, Ben Jannet, et al., 200730. m/0.25 mm/0.25 μm, N2, 50. C @ 1. min, 5. K/min, 240. C @ 4. min
CapillaryDB-51481.Coelho, Grosso, et al., 200730. m/0.25 mm/0.25 μm, He, 70. C @ 5. min, 3. K/min, 310. C @ 20. min
CapillaryRTX-5 MS1474.Edris, Chizzola, et al., 200730. m/0.25 mm/0.25 μm, He, 60. C @ 2. min, 2. K/min, 200. C @ 10. min
CapillaryDB-51482.Elfami, Bos, et al., 200730. m/0.26 mm/0.25 μm, Helium, 3. K/min; Tstart: 60. C; Tend: 290. C
CapillaryHP-51484.Farsam, Amanlou, et al., 200730. m/0.25 mm/0.26 μm, Helium, 60. C @ 2. min, 4. K/min, 240. C @ 20. min
CapillaryHP-5MS1473.Ferhat, Tigrine-Kordjani, et al., 200730. m/0.25 mm/0.25 μm, He, 60. C @ 8. min, 2. K/min, 250. C @ 15. min
CapillaryDB-11487.Ghasempour, Shirinpour, et al., 200760. m/0.25 mm/0.25 μm, Nitrogen, 60. C @ 1. min, 4. K/min, 250. C @ 10. min
CapillaryHP-11485.Hachicha, Skanji, et al., 200730. m/0.25 mm/0.25 μm, He, 2. K/min, 240. C @ 20. min; Tstart: 60. C
CapillaryDBP-51456.Heravi and Sereshti, 200725. m/0.25 mm/0.22 μm, Helium, 40. C @ 1. min, 3. K/min, 250. C @ 10. min
CapillaryRTX-5 MS1481.Hudaib and Aburjai, 200730. m/0.25 mm/0.25 μm, He, 3. K/min; Tstart: 45. C; Tend: 210. C
CapillaryHP-1011439.Jerkovic, Mastelic, et al., 200725. m/0.2 mm/0.2 μm, He, 70. C @ 2. min, 3. K/min; Tend: 200. C
CapillaryBP-11480.Kiran, Devi, et al., 2007He, 5. K/min, 220. C @ 6. min; Tstart: 60. C
CapillaryDB-51469.Limberger, Scopel, et al., 200730. m/0.25 mm/0.25 μm, He, 3. K/min; Tstart: 60. C; Tend: 300. C
CapillaryRTX-5Sil MS1487.Matasyoh, Matasyoh, et al., 200730. m/0.25 mm/0.25 μm, He, 50. C @ 2. min, 5. K/min, 260. C @ 10. min
CapillaryZB-51482.Mohottalage, Tabacchi, et al., 200730. m/0.25 mm/0.25 μm, 60. C @ 5. min, 4. K/min, 220. C @ 20. min
CapillaryDB-11464.Monser-Esfahani, Karamkhani, et al., 200730. m/0.25 mm/0.25 μm, Helium, 50. C @ 1. min, 2.5 K/min, 260. C @ 20. min
CapillaryDB-51450.Moreno, Lima, et al., 200730. m/0.25 mm/0.25 μm, Helium, 3. K/min; Tstart: 60. C; Tend: 300. C
CapillaryDB-51486.Morteza-Semnani, Saeedi, et al., 200730. m/0.25 mm/0.25 μm, Helium, 4. K/min; Tstart: 60. C; Tend: 220. C
CapillaryDB-51469.Nori-Shargh, Raftari, et al., 200730. m/0.25 mm/0.32 μm, He, 5. K/min; Tstart: 50. C; Tend: 250. C
CapillaryHP-51481.Oliveira, Leitão, et al., 200725. m/0.2 mm/0.33 μm, H2, 3. K/min; Tstart: 60. C; Tend: 240. C
CapillaryMethyl Silicone1480.Ozcan and Chalchat, 2007Helium, 3. K/min; Column length: 50. m; Column diameter: 0.25 mm; Tstart: 50. C; Tend: 240. C
CapillaryHP-5 MS1485.Phutdhawong, Kawaree, et al., 200725. m/0.25 mm/0.25 μm, Helium, 100. C @ 3. min, 4. K/min, 280. C @ 5. min
CapillarySPB-51477.Raal, Orav, et al., 200730. m/0.25 mm/0.25 μm, He, 2. K/min; Tstart: 50. C; Tend: 250. C
CapillaryBPX-51529.Rali, Wossa, et al., 200750. m/0.22 mm/1. μm, He, 50. C @ 1. min, 4. K/min, 300. C @ 10. min
CapillaryDB-11487.Reza, Ebrahim, et al., 200760. m/0.25 mm/0.25 μm, Nitrogen, 60. C @ 1. min, 4. K/min, 250. C @ 10. min
CapillaryHP-51476.Ristic, Krivokuca-Dokic, et al., 200730. m/0.25 mm/0.25 μm, Helium, 4. K/min; Tstart: 40. C; Tend: 260. C
CapillaryHP-5 MS1484.Rojas, Velasco, et al., 200760. m/0.25 mm/0.25 μm, Hydrogen, 4. K/min, 260. C @ 20. min; Tstart: 60. C
CapillaryDB-11479.Salehi, Asghari, et al., 200760. m/0.25 mm/0.25 μm, 5. K/min; Tstart: 60. C; Tend: 250. C
CapillaryDBP-51456.Sereshti and Samadi, 200725. m/0.25 mm/0.22 μm, Helium, 40. C @ 1. min, 3. K/min, 250. C @ 10. min
CapillaryDB-51479.Smelcerovic, Spiteller, et al., 200730. m/0.25 mm/0.25 μm, He, 10. K/min, 320. C @ 4. min; Tstart: 60. C
CapillaryDB-11494.Sonboli, Kanani, et al., 200760. m/0.25 mm/0.25 μm, Nitrogen, 5. K/min, 250. C @ 10. min; Tstart: 60. C
CapillaryDB-51482.Sylvestre, Longtin, et al., 200730. m/0.25 mm/0.25 μm, 2. K/min, 210. C @ 33. min; Tstart: 40. C
CapillaryDB-51482.Sylvestre, Pichette, et al., 200730. m/0.25 mm/0.25 μm, 2. K/min, 250. C @ 33. min; Tstart: 40. C
CapillaryElite-5MS1485.Tava, Pecetti, et al., 200730. m/0.32 mm/0.5 μm, He, 40. C @ 5. min, 4. K/min, 280. C @ 10. min
CapillaryHP-5MS1442.Tzakou, Bazos, et al., 200730. m/0.25 mm/0.25 μm, He, 3. K/min; Tstart: 60. C; Tend: 280. C
CapillaryHP-5 MS1485.Vagionas, Graikou, et al., 200730. m/0.25 mm/0.25 μm, Helium, 3. K/min; Tstart: 60. C; Tend: 280. C
CapillaryHP-5MS1462.Vichi, Riu-Aumatell, et al., 200730. m/0.25 mm/0.25 μm, He, 40. C @ 5. min, 3. K/min, 250. C @ 10. min
CapillaryHP-51471.Wenguang, Wenlai, et al., 200730. m/0.25 mm/0.25 μm, 40. C @ 3. min, 5. K/min, 240. C @ 10. min
CapillaryHP-51481.Yassa and Akhani, 200730. m/0.25 mm/0.32 μm, He, 60. C @ 30. min, 5. K/min; Tend: 250. C
CapillaryDB-51465.Apel, Sobral, et al., 200630. m/0.25 mm/0.25 μm, He, 3. K/min; Tstart: 60. C; Tend: 300. C
CapillaryDB-51474.Apel, Sobral, et al., 2006, 230. m/0.25 mm/0.25 μm, 3. K/min; Tstart: 60. C; Tend: 300. C
CapillaryDB-51472.Askari and Sefidkon, 200630. m/0.25 mm/0.25 μm, He, 40. C @ 5. min, 4. K/min; Tend: 260. C
CapillaryCP Sil 5 CB1483.Ayoub, Al-Azizi, et al., 2006He, 10. K/min; Column length: 25. m; Tstart: 80. C; Tend: 270. C
CapillaryDB-51485.Bazargani, Almasirad, et al., 200630. m/0.25 mm/0.25 μm, He, 50. C @ 1. min, 2.5 K/min, 265. C @ 20. min
CapillaryHP-51491.Bertrand, Comte, et al., 200660. m/0.25 mm/0.25 μm, He, 3. K/min; Tstart: 60. C; Tend: 250. C
CapillaryBP-11478.Boti, Yao, et al., 200650. m/0.22 mm/0.25 μm, 2. K/min, 220. C @ 20. min; Tstart: 60. C
CapillaryHP-5MS1490.Bozin, Mimicá-Dukic, et al., 200630. m/0.25 mm/0.25 μm, He, 3. K/min; Tstart: 60. C; Tend: 280. C
CapillarySPB-11466.Cavaleiro, Pinto, et al., 200630. m/0.20 mm/0.20 μm, Helium, 3. K/min, 220. C @ 15. min; Tstart: 70. C
CapillaryHP-51485.Champagnat, Figueredo, et al., 200625. m/0.25 mm/0.25 μm, He, 50. C @ 5. min, 5. K/min; Tend: 300. C
CapillaryDB-51476.Choi, 200630. m/0.25 mm/0.25 μm, N2, 70. C @ 2. min, 2. K/min, 230. C @ 20. min
CapillaryDB-51480.Damjanovic, Skala, et al., 200630. m/0.32 mm/0.25 μm, 3. K/min, 230. C @ 15. min; Tstart: 60. C
CapillaryHP-5MS1478.Ebrahim Sajjadi and Mehregan, 200630. m/0.25 mm/0.25 μm, 4. K/min; Tstart: 60. C; Tend: 280. C
CapillaryDB-51482.Elfami, Komar, et al., 200630. m/0.26 mm/0.25 μm, Helium, 3. K/min; Tstart: 60. C; Tend: 290. C
CapillaryBP-11480.Fanciullino, Tomi, et al., 200650. m/0.22 mm/0.25 μm, He, 2. K/min, 220. C @ 20. min; Tstart: 60. C
CapillaryHP-11470.Fernandez, Pintaric, et al., 200650. m/0.2 mm/0.33 μm, He, 2. K/min, 250. C @ 60. min; Tstart: 60. C
CapillaryHP-51481.Figuérédo, Cabassu, et al., 200630. m/0.25 mm/0.25 μm, He, 50. C @ 5. min, 5. K/min, 300. C @ 5. min
CapillaryHP-11473.Filippi, Lanfranchi, et al., 200650. m/0.2 mm/0.33 μm, He, 2. K/min, 250. C @ 40. min; Tstart: 60. C
CapillaryDB-51482.Garneau F.X., Collin G., et al., 200630. m/0.25 mm/0.25 μm, 40. C @ 2. min, 2. K/min, 210. C @ 33. min
CapillaryDB-11489.Gohari, Hadjiakhoondi, et al., 200660. m/0.25 mm/0.25 μm, He, 60. C @ 2. min, 5. K/min; Tend: 240. C
CapillaryDB-51480.Gohari, Hadjiakhoondi, et al., 200630. m/0.25 mm/0.25 μm, He, 60. C @ 2. min, 5. K/min; Tend: 240. C
CapillaryDB-11489.Gohari A.R., Hadjiakhoondi A., et al., 200660. m/0.25 mm/0.25 μm, He, 60. C @ 2. min, 5. K/min; Tend: 240. C
CapillaryDB-51480.Gohari A.R., Hadjiakhoondi A., et al., 200630. m/0.25 mm/0.25 μm, He, 60. C @ 2. min, 5. K/min; Tend: 240. C
CapillaryHP-51480.Ibañez and Usubillaga, 200630. m/0.25 mm/0.25 μm, He, 4. K/min; Tstart: 60. C; Tend: 240. C
CapillaryHP-5MS1480.Ibanez and Usubillaga, 200630. m/0.25 mm/0.25 μm, He, 4. K/min; Tstart: 60. C; Tend: 260. C
CapillaryBP-11480.Kiran, Bhavani, et al., 2006Helium, 5. K/min, 220. C @ 6. min; Tstart: 60. C
CapillaryMethyl Silicone1491.Kitchlu, Bakshi, et al., 200625. m/0.25 mm/0.25 μm, He, 90. C @ 2. min, 7. K/min; Tend: 220. C
CapillaryHP-51481.Kucuk, Gulec, et al., 200630. m/0.32 mm/0.25 μm, Helium, 60. C @ 2. min, 5. K/min, 260. C @ 13. min
CapillaryRTX-11481.Kula, Izydorczyk, et al., 200630. m/0.32 mm/0.25 μm, He, 4. K/min; Tstart: 60. C; Tend: 300. C
CapillaryHP-51480.Lago, Soares, et al., 200630. m/0.25 mm/0.25 μm, He, 100. C @ 2. min, 5. K/min, 240. C @ 5. min
CapillaryDB-11474.Lan Phi N.T., Nishiyama C., et al., 200660. m/0.25 mm/0.25 μm, 70. C @ 2. min, 2. K/min, 230. C @ 20. min
CapillaryCP Sil 5 CB1470.Lis and Milczarek, 200630. m/0.32 mm/0.25 μm, N2, 4. K/min; Tstart: 50. C; Tend: 300. C
CapillaryCP Sil 5 CB1481.Martin, Joseph, et al., 200630. m/0.25 mm/0.25 μm, N2, 5. K/min; Tstart: 50. C; Tend: 200. C
Capillary5 % Phenyl methyl siloxane1457.Marongiu, Piras, et al., 200630. m/0.25 mm/0.25 μm, Helium, 3. K/min, 280. C @ 30. min; Tstart: 60. C
CapillaryDB-51485.Mirza, Navaei, et al., 200630. m/0.25 mm/0.25 μm, Helium, 50. C @ 5. min, 3. K/min; Tend: 250. C
CapillaryDB-51488.Morteza-Semnani, Akbarzadeh, et al., 200630. m/0.25 mm/0.25 μm, He, 4. K/min; Tstart: 60. C; Tend: 220. C
CapillaryDB-51488.Morteza-Semnani K., Akbarzadeh M., et al., 200630. m/0.25 mm/0.25 μm, He, 60. C @ 5. min, 4. K/min; Tend: 220. C
CapillaryDB-51488.Morteza-Semnani, Saeedi, et al., 200630. m/0.25 mm/0.25 μm, He, 60. C @ 4. min, 4. K/min; Tend: 260. C
CapillaryDB-51488.Morteza-Semnani K., Saeedi M., et al., 200630. m/0.25 mm/0.25 μm, He, 60. C @ 5. min, 4. K/min; Tend: 220. C
CapillaryDB-51487.Najafpour Navaei, Mirza, et al., 200630. m/0.25 mm/0.25 μm, He, 4. K/min; Tstart: 50. C; Tend: 250. C
CapillaryDB-51483.Navaei and Mirza, 200630. m/0.25 mm/0.25 μm, He, 50. C @ 5. min, 3. K/min; Tend: 250. C
CapillaryCP-Sil 5 CB1482.Olawore, Usman, et al., 200625. m/0.25 mm/0.15 μm, Hydrogen, 3. K/min; Tstart: 50. C; Tend: 230. C
CapillaryNB-301474.Orav, Raal, et al., 200630. m/0.2 mm/0.25 μm, He, 2. K/min; Tstart: 50. C; Tend: 250. C
CapillaryDB-51487.Ouamba, Ouabonzi, et al., 200625. m/0.25 mm/0.15 μm, N2, 50. C @ 3. min, 4. K/min; Tend: 200. C
CapillarySE-521480.Ozcan, Chalchat, et al., 2006Helium, 3. K/min; Column length: 50. m; Column diameter: 0.25 mm; Tstart: 50. C; Tend: 240. C
CapillaryDB-11466.Pala-Paul J., Perez-Alonso M.J., et al., 200650. m/0.25 mm/0.25 μm, N2, 4. K/min; Tstart: 95. C; Tend: 240. C
CapillaryHP-51487.Pintore G., Chessa M., et al., 200630. m/0.25 mm/0.25 μm, He, 60. C @ 10. min, 5. K/min; Tend: 220. C
CapillaryDB-51480.Pino, Marbot, et al., 200630. m/0.25 mm/0.25 μm, Hydrogen, 70. C @ 4. min, 4. K/min; Tend: 280. C
CapillaryDB-51482.Pino, Marbot, et al., 200630. m/0.25 mm/0.25 μm, Hydrogen, 70. C @ 4. min, 4. K/min; Tend: 280. C
CapillaryHP-51480.Pino, Sauri-Duch, et al., 200630. m/0.25 mm/0.25 μm, H2, 50. C @ 2. min, 4. K/min, 280. C @ 10. min
CapillaryHP-5MS1451.Pitarokili, Tzakou, et al., 200630. m/0.25 mm/0.25 μm, He, 3. K/min; Tstart: 60. C; Tend: 280. C
CapillaryHP-51484.Potzernheim, Bizzo, et al., 200625. m/0.32 mm/0.25 μm, H2, 3. K/min; Tstart: 60. C; Tend: 240. C
CapillaryDB-51479.Rout, Naik, et al., 200630. m/0.25 mm/0.25 μm, He, 2. K/min, 200. C @ 60. min; Tstart: 60. C
CapillaryHP-5MS1482.Sajjadi, 200630. m/0.25 mm/0.25 μm, He, 4. K/min; Tstart: 60. C; Tend: 280. C
CapillaryDB-11477.Sawamura, Onishi, et al., 200660. m/0.25 mm/0.25 μm, 70. C @ 2. min, 2. K/min, 230. C @ 20. min
CapillaryDB-11473.Sefidkon, Jamzad, et al., 2006He, 4. K/min; Column length: 60. m; Column diameter: 0.25 mm; Tstart: 40. C; Tend: 250. C
CapillaryDB-51478.Senatore, Landolfi, et al., 200630. m/0.25 mm/0.25 μm, He, 40. C @ 5. min, 2. K/min, 260. C @ 20. min
CapillaryHP-5MS1481.Setzer, Noletto, et al., 200630. m/0.25 mm/0.25 μm, He, 60. C @ 5. min, 3. K/min; Tend: 280. C
CapillaryHP-51499.Shafi, Jose, et al., 200625. m/0.2 mm/0.33 μm, N2, 3. K/min; Tstart: 30. C; Tend: 280. C
CapillaryDB-51479.Silva, Oliveira, et al., 200630. m/0.20 mm/0.18 μm, H2, 3. K/min; Tstart: 60. C; Tend: 240. C
CapillaryDB-11480.Sonboli, Mirjalili, et al., 200660. m/0.25 mm/0.25 μm, Helium, 5. K/min, 250. C @ 10. min; Tstart: 60. C
CapillaryCP Sil 5 CB1482.Tesso, Kubeczka, et al., 20063. K/min; Column length: 25. m; Column diameter: 0.25 mm; Tstart: 50. C; Tend: 230. C
CapillaryMethyl Silicone1508.Tonzibo, Coffy, et al., 200625. m/0.3 mm/0.15 μm, N2, 50. C @ 5. min, 2. K/min; Tend: 210. C
CapillaryHP-51480.Wang, Kong, et al., 200625. m/0.32 mm/0.52 μm, H2, 50. C @ 5. min, 2.5 K/min; Tend: 280. C
CapillarySPB-11471.Wong, Lim, et al., 200650. m/0.2 mm/0.33 μm, He, 50. C @ 1. min, 4. K/min, 220. C @ 10. min
CapillarySPB-11458.Wong, Sivasothy, et al., 200630. m/0.25 mm/0.25 μm, He, 50. C @ 1. min, 4. K/min, 250. C @ 10. min
CapillaryHP-51480.Yayli, Gülec, et al., 200630. m/0.32 mm/0.25 μm, He, 60. C @ 2. min, 5. K/min, 260. C @ 14. min
CapillaryHP-51483.Yayli, Gülec, et al., 200630. m/0.32 mm/0.25 μm, He, 60. C @ 2. min, 5. K/min, 260. C @ 14. min
CapillaryHP-5MS1487.Asadipour, Mehrabani, et al., 200530. m/0.25 mm/0.25 μm, He, 4. K/min; Tstart: 60. C; Tend: 275. C
CapillaryDB-51472.Askari and Sefidkon, 200530. m/0.25 mm/0.25 μm, He, 60. C @ 5. min, 3. K/min; Tend: 210. C
CapillaryHP-5MS1456.Basta, Tzakou, et al., 200530. m/0.25 mm/0.25 μm, He, 3. K/min; Tstart: 60. C; Tend: 280. C
CapillaryDB-5MS1481.Busman, Zoghbi, et al., 200530. m/0.25 mm/0.25 μm, He, 3. K/min; Tstart: 60. C; Tend: 240. C
CapillaryDB-51480.Chagonda and Chalchat, 200550. m/0.3 mm/0.25 μm, 2. K/min; Tstart: 60. C; Tend: 240. C
CapillaryDB-51480.Chagonda and Chalchat, 2005, 225. m/0.25 mm/0.15 μm, 40. C @ 5. min, 3. K/min; Tend: 220. C
CapillaryDB-51481.Chaverri and Cicció, 200530. m/0.25 mm/0.25 μm, He, 3. K/min; Tstart: 60. C; Tend: 240. C
CapillaryDB-51489.Chaverri and Cicció, 200530. m/0.25 mm/0.25 μm, He, 3. K/min; Tstart: 60. C; Tend: 240. C
CapillaryMethyl Silicone1482.Chalchat and Özcan, 2005He, 3. K/min; Column length: 60. m; Column diameter: 0.3 mm; Tstart: 50. C; Tend: 240. C
CapillaryBPX51490.Dickschat, Bode, et al., 200525. m/0.22 mm/0.25 μm, Helium, 50. C @ 5. min, 5. K/min; Tend: 320. C
CapillaryHP-51479.Duarte, Figueira, et al., 200525. m/0.2 mm/0.33 μm, He, 3. K/min, 240. C @ 7. min; Tstart: 60. C
CapillaryCP Sil 8 CB1461.Facey, Porter, et al., 200530. m/0.25 mm/0.25 μm, He, 80. C @ 5. min, 3. K/min, 200. C @ 5. min
CapillaryDB-11492.Fakhari A.R., Sonboli A., et al., 200560. m/0.25 mm/0.25 μm, N2, 5. K/min, 250. C @ 10. min; Tstart: 60. C
CapillaryDB-51475.Ferraz, Limberger, et al., 200530. m/0.25 mm/0.25 μm, He, 60. C @ 3. min, 3. K/min; Tend: 300. C
CapillaryHP-11472.Fernandez, Lizzani-Cuvelier, et al., 200550. m/0.2 mm/0.25 μm, 60. C @ 60. min, 2. K/min; Tend: 250. C
CapillaryHP-51485.Ferretti, Maggi, et al., 200530. m/0.25 mm/0.25 μm, He, 60. C @ 3. min, 4. K/min, 30. C @ 15. min
CapillaryHP-51481.Figuérédo, Cabassu, et al., 200530. m/0.25 mm/0.25 μm, He, 50. C @ 5. min, 5. K/min, 300. C @ 5. min
CapillaryHP-5MS1476.Gauvin and Smadja, 200530. m/0.25 mm/0.25 μm, He, 60. C @ 30. min, 4. K/min; Tend: 200. C
CapillaryHP-5MS1480.Ghasemi Y., Faridi P., et al., 2005He, 50. C @ 3. min, 3. K/min, 250. C @ 10. min; Column length: 25. m; Column diameter: 0.25 mm
CapillaryHP-5MS1476.Grombone-Guaratini, Silva-Brandão, et al., 200530. m/0.25 mm/0.25 μm, He, 3. K/min; Tstart: 60. C; Tend: 300. C
CapillaryCP Sil 5 CB1491.Jassbi, Mehrdad, et al., 200530. m/0.25 mm/0.25 μm, N2, 5. K/min, 250. C @ 10. min; Tstart: 60. C
CapillaryCP Sil 5 CB1494.Jassbi, Mehrdad, et al., 200530. m/0.25 mm/0.25 μm, N2, 5. K/min, 250. C @ 10. min; Tstart: 60. C
CapillaryHP-51461.Jovanovic, Kitic, et al., 200525. m/0.32 mm/0.52 μm, H2, 4. K/min; Tstart: 40. C; Tend: 240. C
CapillaryDB-11463.Khanavi, Ghasemian, et al., 200530. m/0.25 mm/0.25 μm, He, 50. C @ 1. min, 2.5 K/min, 265. C @ 20. min
CapillaryDB-11479.Khajeh, Yamini, et al., 200560. m/0.25 mm/0.25 μm, He, 50. C @ 5. min, 4. K/min; Tend: 250. C
CapillaryDB-51488.Kowalski and Wolski, 200530. m/0.25 mm/0.25 μm, 35. C @ 2. min, 4. K/min; Tend: 280. C
CapillaryDB-51488.Kowalski, 200530. m/0.25 mm/0.25 μm, Helium, 35. C @ 2. min, 4. K/min; Tend: 280. C
CapillaryDB-5MS1454.Marongiu, Piras, et al., 200530. m/0.25 mm/0.25 μm, He, 60. C @ 30. min, 3. K/min; Tend: 280. C
CapillaryHP-5MS1492.Melkani, Dev, et al., 200530. m/0.25 mm/0.25 μm, 50. C @ 10. min, 3. K/min, 250. C @ 5. min
CapillaryDB-51485.Morteza-Semnani, Akbarzadeh, et al., 200530. m/0.25 mm/0.25 μm, He, 60. C @ 5. min, 4. K/min; Tend: 220. C
CapillaryDB-51480.Morteza-Semnani, Akbarzadeh, et al., 2005, 230. m/0.25 mm/0.25 μm, He, 60. C @ 5. min, 4. K/min; Tend: 220. C
CapillaryDB-51482.Morteza-Semnani and Saeedi, 200530. m/0.25 mm/0.25 μm, He, 60. C @ 4. min, 4. K/min; Tend: 220. C
CapillaryDB-51480.Najafpour Navaei, Mirza, et al., 200530. m/0.25 mm/0.25 μm, He, 50. C @ 5. min, 3. K/min; Tend: 250. C
CapillaryCP Sil 5 CB1478.Olawore, Ogunwande, et al., 200525. m/0.25 mm/0.15 μm, 3. K/min; Tstart: 50. C; Tend: 230. C
CapillaryDB-51482.Özel, Gögüs, et al., 200530. m/0.32 mm/0.25 μm, He, 40. C @ 0.5 min, 5. K/min, 250. C @ 2. min
CapillaryDB-11476.Pala-Paul, Perez-Alonso, et al., 200550. m/0.25 mm/0.25 μm, N2, 4. K/min; Tstart: 95. C; Tend: 240. C
CapillaryHP-5MS1485.Petrakis, Roussis, et al., 20053. K/min; Column length: 30. m; Column diameter: 0.2 mm; Tstart: 60. C; Tend: 280. C
CapillaryDB-11472.Rasooli and Owlia, 200560. m/0.25 mm/0.25 μm, He, 4. K/min; Tstart: 50. C; Tend: 250. C
CapillaryCP Sil 5 CB1485.Rohloff and Bones, 200530. m/0.25 mm/0.25 μm, He, 40. C @ 1. min, 4. K/min; Tend: 220. C
CapillaryHP-51480.Saeidnia, Gohari, et al., 2005He, 5. K/min; Column length: 30. m; Column diameter: 0.25 mm; Tstart: 60. C; Tend: 240. C
CapillaryHP-5MS1479.Sajjadi S.E. and Eskandari B., 200530. m/0.25 mm/0.25 μm, He, 4. K/min; Tstart: 60. C; Tend: 280. C
CapillaryHP-5MS1481.Sajjadi and Ghannadi, 200530. m/0.25 mm/0.25 μm, He, 4. K/min; Tstart: 60. C; Tend: 275. C
CapillaryHP-5MS1480.Sajjadi, 200530. m/0.25 mm/0.25 μm, He, 4. K/min; Tstart: 60. C; Tend: 280. C
CapillaryDB-51485.Salehi, Sefidkon, et al., 200530. m/0.25 mm/0.25 μm, He, 60. C @ 4. min, 3. K/min; Tend: 220. C
CapillaryDB-11484.Salehi, Sonboli, et al., 200560. m/0.25 mm/0.25 μm, He, 5. K/min, 250. C @ 10. min; Tstart: 60. C
CapillaryDB-11465.Sarkhail, Amin, et al., 200530. m/0.25 mm/0.25 μm, He, 50. C @ 1. min, 2.5 K/min, 265. C @ 20. min
CapillaryDB-51478.Sefidkon and Jamzad, 2005He, 4. K/min; Column length: 30. m; Column diameter: 0.25 mm; Tstart: 40. C; Tend: 240. C
CapillaryDB-51478.Senatore, Apostolides Arnold, et al., 200530. m/0.25 mm/0.25 μm, He, 40. C @ 5. min, 2. K/min, 260. C @ 20. min
CapillaryHP-5MS1481.Setzer, Noletto, et al., 200530. m/0.25 mm/0.25 μm, He, 60. C @ 5. min, 3. K/min; Tend: 280. C
CapillaryDB-51475.Simoes-Pires C.A., Debenedetti S., et al., 200530. m/0.25 mm/0.25 μm, He, 3. K/min; Tstart: 60. C; Tend: 300. C
CapillaryPE-51479.Singh, Raina, et al., 200530. m/0.32 mm/0.25 μm, H2, 60. C @ 2. min, 5. K/min, 230. C @ 4. min
CapillaryDB-51485.Skoula and Grayer, 200530. m/0.25 mm/0.25 μm, He, 3. K/min, 230. C @ 20. min; Tstart: 60. C
CapillaryHP-5MS1480.Slavkovska, Couladis, et al., 200530. m/0.25 mm/0.25 μm, He, 3. K/min; Tstart: 60. C; Tend: 280. C
CapillaryRTX-11485.Sonboli, Salehi, et al., 200560. m/0.25 mm/0.25 μm, He, 5. K/min, 25. C @ 10. min; Tstart: 60. C
CapillaryDB-11484.Sonboli, Salehi, et al., 2005, 260. m/0.25 mm/0.25 μm, He, 5. K/min, 250. C @ 10. min; Tstart: 60. C
CapillaryBP-11475.Srivastava, Srivastava, et al., 200530. m/0.32 mm/0.25 μm, N2, 5. K/min, 220. C @ 15. min; Tstart: 60. C
CapillaryDB-51486.Stevanovic, Garneau, et al., 200530. m/0.25 mm/0.25 μm, 40. C @ 2. min, 2. K/min, 210. C @ 33. min
CapillaryRTX-51479.Szafranek, Chrapkowska, et al., 200530. m/0.25 mm/0.25 μm, 3. K/min; Tstart: 60. C; Tend: 220. C
CapillaryHP-5 MS1480.Topçu, Barla, et al., 200530. m/0.25 mm/0.50 μm, He, 3. K/min, 260. C @ 20. min; Tstart: 60. C
CapillaryHP-5MS1442.Tzakou, Bazos, et al., 200530. m/0.25 mm/0.25 μm, He, 3. K/min; Tstart: 60. C; Tend: 280. C
CapillaryDB-51449.Tzakou and Constantinidis, 200530. m/0.32 mm/0.25 μm, He, 3. K/min; Tstart: 60. C; Tend: 280. C
CapillaryHP-5 MS1485.Urdampilleta, Amat, et al., 200530. m/0.25 mm/0.25 μm, Helium, 3. K/min; Tstart: 60. C; Tend: 240. C
CapillaryDB-11460.Velasco-Negueruela, Pérez-Alonso, et al., 200550. m/0.25 mm/0.25 μm, N2, 4. K/min; Tstart: 90. C; Tend: 240. C
CapillaryHP-5MS1462.Vichi, Riu-Aumatell, et al., 200530. m/0.25 mm/0.25 μm, 40. C @ 5. min, 3. K/min, 220. C @ 10. min
CapillarySPB-11479.Wong, Lee, et al., 200550. m/0.2 mm/0.33 μm, He, 50. C @ 3. min, 4. K/min, 220. C @ 30. min
CapillaryHP-51472.N/A30. m/0.32 mm/0.25 μm, Helium, 40. C @ 2. min, 5. K/min, 250. C @ 5. min
CapillaryHP-51481.Yayli, Yasar, et al., 200530. m/0.32 mm/0.25 μm, He, 60. C @ 2. min, 5. K/min, 260. C @ 13. min
CapillaryHP-51489.Aghel, Yamini, et al., 200430. m/0.25 mm/0.32 μm, He, 60. C @ 3. min, 5. K/min; Tend: 250. C
CapillaryCP Sil 5 CB1482.Agnaniet, Menut, et al., 200430. m/0.25 mm/0.25 μm, N2, 5. K/min; Tstart: 50. C; Tend: 200. C
CapillaryDB-51471.Agnihotri, Thappa, et al., 200430. m/0.25 mm/0.25 μm, He, 90. C @ 2. min, 7. K/min, 220. C @ 5. min
CapillaryDB-51485.Cicció, 200430. m/0.25 mm/0.25 μm, He, 2. K/min; Tstart: 60. C; Tend: 240. C
CapillaryDB-11484.Fekam Boyom, Fotio, et al., 200430. m/0.25 mm/0.25 μm, N2, 5. K/min; Tstart: 50. C; Tend: 200. C
CapillaryDB-51480.González, Guerra, et al., 200430. m/0.25 mm/0.25 μm, N2, 2. K/min; Tstart: 40. C; Tend: 230. C
CapillaryDB-51480.JAvidnia, Mojab, et al., 200425. m/0.25 mm/0.25 μm, Nitrogen, 3. K/min; Tstart: 60. C; Tend: 240. C
CapillaryDB-51481.Kalvandi, Sefidkon, et al., 200460. m/0.25 mm/0.25 μm, He, 40. C @ 4. min, 4. K/min; Tend: 280. C
CapillaryRTX-11480.Kalemba and Thiem, 200430. m/0.25 mm/0.25 μm, N2, 4. K/min; Tstart: 60. C; Tend: 300. C
CapillarySE-541472.Kilic, Hafizoglu, et al., 200430. m/0.25 mm/0.25 μm, He, 60. C @ 5. min, 2. K/min; Tend: 260. C
CapillaryDB-51455.Lago, de Ávila, et al., 200430. m/0.25 mm/0.25 μm, He, 3. K/min; Tstart: 60. C; Tend: 300. C
CapillaryHP-5MS1456.Li and Jiang, 200430. m/0.25 mm/0.25 μm, He, 50. C @ 2. min, 5. K/min, 230. C @ 10. min
CapillaryDB-51464.Limberger, Sobral, et al., 200430. m/0.25 mm/0.25 μm, He, 3. K/min; Tstart: 60. C; Tend: 300. C
CapillaryRTX-11480.Lis, Boczek, et al., 200430. m/0.32 mm/0.25 μm, N2, 4. K/min; Tstart: 60. C; Tend: 300. C
CapillaryDB-51483.Lopez Arze, Collin, et al., 200430. m/0.25 mm/0.25 μm, 40. C @ 2. min, 2. K/min, 210. C @ 33. min
CapillaryHP-5MS1477.Malencic, Couladis, et al., 200430. m/0.25 mm/0.25 μm, He, 3. K/min; Tstart: 60. C; Tend: 280. C
CapillaryBP-11481.Mallavarapu, Kulkarni, et al., 200425. m/0.25 mm/0.25 μm, N2, 5. K/min; Tstart: 60. C; Tend: 220. C
CapillaryHP-5MS1483.Mehrabani, Asadipour, et al., 200430. m/0.25 mm/0.25 μm, He, 4. K/min; Tstart: 60. C; Tend: 275. C
CapillaryHP-5MS1490.Mimica-Dukic, Bozin, et al., 200430. m/0.25 mm/0.25 μm, He, 3. K/min; Tstart: 60. C; Tend: 280. C
CapillaryDB-11476.Nik, Mirza, et al., 200460. m/0.25 mm/0.25 μm, He, 4. K/min; Tstart: 50. C; Tend: 270. C
CapillaryNB-301478.Orav, Stulova, et al., 200450. m/0.2 mm/0.25 μm, He, 2. K/min; Tstart: 50. C; Tend: 250. C
CapillaryNB-301478.Orav, Stulova, et al., 200450. m/0.2 mm/0.25 μm, He, 2. K/min; Tstart: 50. C; Tend: 250. C
CapillaryDB-51473.Palá-Paúl, Brophy, et al., 200430. m/0.25 mm/0.25 μm, He, 3. K/min; Tstart: 35. C; Tend: 220. C
CapillaryNB-301478.Raal, Paaver, et al., 200450. m/0.20 mm/0.25 μm, He, 2. K/min; Tstart: 50. C; Tend: 250. C
CapillaryDB-11472.Rasooli and Razzaghi Abyaneh, 200460. m/0.25 mm/0.25 μm, He, 4. K/min; Tstart: 50. C; Tend: 250. C
CapillaryDB-51485.Rohloff, Mordal, et al., 200430. m/0.25 mm/0.25 μm, He, 2.5 K/min, 220. C @ 6. min; Tstart: 35. C
CapillaryHP-5MS1472.Sadeghpour, Asghari, et al., 200430. m/0.25 mm/0.25 μm, He, 4. K/min; Tstart: 60. C; Tend: 280. C
CapillaryHP-5MS1478.Sajjadi and Shahpiri, 200430. m/0.25 mm/0.25 μm, He, 4. K/min; Tstart: 60. C; Tend: 280. C
CapillaryDB-11465.Sarkhail, Amin, et al., 200430. m/0.25 mm/0.25 μm, He, 50. C @ 1. min, 2.5 K/min, 265. C @ 20. min
CapillaryDB-11473.Sefidkon and Shaabani, 200460. m/0.25 mm/0.25 μm, He, 40. C @ 5. min, 4. K/min; Tend: 280. C
CapillaryHP-11476.Senatore, Napolitano, et al., 200430. m/0.25 mm/0.33 μm, He, 40. C @ 5. min, 2. K/min, 260. C @ 20. min
CapillaryDB-51476.Senatore, Rigano, et al., 200430. m/0.25 mm/0.25 μm, He, 40. C @ 5. min, 2. K/min, 250. C @ 20. min
CapillaryHP-51499.Shafi, Nambiar, et al., 200425. m/0.2 mm/0.5 μm, N2, 3. K/min; Tstart: 30. C; Tend: 280. C
CapillaryDB-51474.Suyenaga, Apel, et al., 200430. m/0.25 mm/0.25 μm, 3. K/min; Tstart: 60. C; Tend: 300. C
CapillaryCP Sil 5 CB1468.Thappa, Bakshi, et al., 200420. m/0.25 mm/0.25 μm, He, 100. C @ 2. min, 8. K/min; Tend: 270. C
CapillaryDB-51485.Tirillini, Pellegrino, et al., 200430. m/0.25 mm/0.25 μm, He, 3. K/min; Tstart: 60. C; Tend: 300. C
CapillaryBPX-51510.Vilaseca, Guy, et al., 200425. m/0.22 mm/1. μm, He, 60. C @ 5. min, 3. K/min, 250. C @ 10. min
CapillaryHP-5MS1479.Afsharypuor and Jahromy, 200330. m/0.25 mm/0.25 μm, He, 4. K/min; Tstart: 60. C; Tend: 275. C
CapillaryHP-51482.Bertoli, Menichini, et al., 200330. m/0.25 mm/0.25 μm, N2, 60. C @ 10. min, 5. K/min; Tend: 220. C
CapillaryHP-51480.Chaves, Lago, et al., 200330. m/0.32 mm/0.25 μm, He, 100. C @ 2. min, 5. K/min, 240. C @ 5. min
CapillaryHP-5MS1478.Couladis, Özcan, et al., 200330. m/0.25 mm/0.25 μm, He, 3. K/min; Tstart: 60. C; Tend: 280. C
CapillaryMethyl Silicone1468.Curini, Bianchi, et al., 2003He, 4. K/min; Column length: 12.5 m; Column diameter: 0.25 mm; Tstart: 50. C; Tend: 270. C
CapillaryDB-11472.Dabiri and Sefidkon, 2003He, 4. K/min; Column length: 60. m; Column diameter: 0.25 mm; Tstart: 50. C; Tend: 250. C
CapillaryHP-5MS1487.Feizbaksh, Saber Tehrani, et al., 200330. m/0.25 mm/0.25 μm, He, 60. C @ 20. min, 5. K/min, 220. C @ 20. min
CapillaryDB-11461.Fekam Boyom, Ngouana, et al., 200330. m/0.25 mm/0.25 μm, N2, 5. K/min; Tstart: 50. C; Tend: 200. C
CapillaryHP-5MS1481.Ghannadi, Aghazari, et al., 200330. m/0.25 mm/0.25 μm, He, 4. K/min; Tstart: 60. C; Tend: 275. C
CapillaryHP-5MS1480.Ghasemi, Asghari, et al., 200330. m/0.25 mm/0.25 μm, He, 4. K/min; Tstart: 60. C; Tend: 280. C
CapillaryHP-5MS1485.Hajhashemi, Ghannadi, et al., 200330. m/0.25 mm/0.25 μm, He, 4. K/min; Tstart: 60. C; Tend: 275. C
CapillaryMethyl Silicone1476.Jayaprakasha, Rao, et al., 200330. m/0.32 mm/0.25 μm, He, 60. C @ 2. min, 2. K/min, 250. C @ 5. min
CapillaryRSL-2001481.Jirovetz, Buchbauer, et al., 200330. m/0.32 mm/0.25 μm, H2, 40. C @ 5. min, 6. K/min, 280. C @ 5. min
CapillaryRSL-2001469.Jirovetz, Buchbauer, et al., 2003, 230. m/0.32 mm/0.25 μm, H2, 40. C @ 5. min, 6. K/min, 280. C @ 5. min
CapillaryCP Sil 5 CB1470.Kanjilal, Kotoky, et al., 200325. m/0.25 mm/0.25 μm, He, 35. C @ 2.5 min, 5. K/min; Tend: 280. C
CapillaryDB-51472.Lago, de Ávila, et al., 200330. m/0.25 mm/0.25 μm, He, 5. K/min; Tstart: 60. C; Tend: 280. C
CapillaryDB-51478.Limberger, Simões-Pires, et al., 200330. m/0.25 mm/0.25 μm, He, 3. K/min; Tstart: 60. C; Tend: 250. C
CapillaryDB-5MS1482.Maia, Taveira, et al., 200330. m/0.25 mm/0.25 μm, He, 3. K/min; Tstart: 60. C; Tend: 240. C
CapillaryDB-51469.Marongiu, Porcedda, et al., 200330. m/0.25 mm/0.25 μm, He, 3. K/min, 280. C @ 30. min; Tstart: 60. C
CapillaryDB-51476.Marongiu, Porcedda, et al., 200330. m/0.25 mm/0.25 μm, He, 3. K/min, 280. C @ 30. min; Tstart: 60. C
CapillaryDB-51486.Masotti, Juteau, et al., 200350. m/0.2 mm/0.25 μm, He, 50. C @ 2. min, 3. K/min; Tend: 220. C
CapillaryCP Sil 5 CB1480.Mazloomifar, Saber-Tehrani, et al., 200325. m/0.25 mm/0.39 μm, 5. K/min; Tstart: 60. C; Tend: 220. C
CapillaryDB-11472.Mirza and Nik, 200360. m/0.25 mm/0.25 μm, He, 4. K/min; Tstart: 50. C; Tend: 270. C
CapillaryDB-11476.Mirza, Nik, et al., 200360. m/0.25 mm/0.25 μm, He, 4. K/min; Tstart: 50. C; Tend: 270. C
CapillaryHP-51479.Mookdasanit, Tamura, et al., 2003Helium, 2. K/min, 210. C @ 60. min; Column length: 30. m; Column diameter: 0.32 mm; Tstart: 70. C
CapillaryOV-1011467.Orav, Kailas, et al., 200350. m/0.2 mm/0.5 μm, He, 2. K/min; Tstart: 50. C; Tend: 250. C
CapillaryCP Sil 5 CB1466.Oyedeji, Ekundayo, et al., 200325. m/0.25 mm/0.15 μm, H2, 3. K/min; Tstart: 50. C; Tend: 230. C
CapillaryDB-11471.Perez-Alonso, Velasco-Negueruela, et al., 200350. m/0.25 mm/0.25 μm, N2, 4. K/min; Tstart: 95. C; Tend: 240. C
CapillaryDB-51480.Pino, Marbot, et al., 200330. m/0.25 mm/0.25 μm, H2, 60. C @ 10. min, 4. K/min, 280. C @ 40. min
CapillaryHP-51461.Pitarokili, Tzakou, et al., 200330. m/0.25 mm/0.25 μm, He, 3. K/min; Tstart: 60. C; Tend: 280. C
CapillaryDB-51474.Priestap, van Baren, et al., 200330. m/0.2 mm/0.25 μm, He, 75. C @ 4. min, 3. K/min; Tend: 220. C
CapillaryNB-301478.Raal, Arak, et al., 200350. m/0.2 mm/0.5 μm, He, 2. K/min; Tstart: 50. C; Tend: 250. C
CapillaryHP-51482.Sajjadi and Mehregan, 200330. m/0.25 mm/0.25 μm, He, 4. K/min; Tstart: 60. C; Tend: 280. C
CapillaryHP-51479.Sajjadi and Mehregan, 2003, 230. m/0.25 mm/0.25 μm, He, 4. K/min; Tstart: 60. C; Tend: 280. C
CapillaryDB-51480.Senatore and Bruno, 200330. m/0.25 mm/0.25 μm, 40. C @ 5. min, 2. K/min; Tend: 260. C
CapillaryDB-11473.Shahmir, Ahmadi, et al., 200360. m/0.25 mm/0.25 μm, He, 4. K/min; Tstart: 50. C; Tend: 280. C
CapillaryHP-51480.Stashenko, Jaramillo, et al., 200360. m/0.25 mm/0.25 μm, 40. C @ 15. min, 5. K/min; Tend: 250. C
CapillaryHP-51480.Stashenko, Jaramillo, et al., 200360. m/0.25 mm/0.25 μm, 40. C @ 15. min, 5. K/min; Tend: 250. C
CapillaryDB-11481.Tu, Onishi, et al., 200360. m/0.25 mm/0.25 μm, N2, 70. C @ 2. min, 2. K/min, 230. C @ 20. min
CapillaryHP-51477.Velickovic, Ristic, et al., 200325. m/0.32 mm/0.53 μm, Helium, 4. K/min; Tstart: 40. C; Tend: 280. C
CapillaryHP-51477.Velickovic, Ristic, et al., 200325. m/0.32 mm/0.53 μm, Helium, 4. K/min; Tstart: 40. C; Tend: 280. C
CapillaryHP-51479.Velickovic, Ristic, et al., 200325. m/0.32 mm/0.53 μm, Helium, 4. K/min; Tstart: 40. C; Tend: 280. C
CapillaryHP-51485.Velickovic, Ristic, et al., 200325. m/0.32 mm/0.53 μm, Helium, 4. K/min; Tstart: 40. C; Tend: 280. C
CapillaryHP-51482.Yassa, Akhani, et al., 200330. m/0.25 mm/0.32 μm, He, 60. C @ 30. min, 5. K/min; Tend: 250. C
CapillaryDB-51481.Zoghbi, Andrade, et al., 200330. m/0.25 mm/0.25 μm, He, 3. K/min; Tstart: 60. C; Tend: 240. C
CapillaryDB-51480.Zrira, Elamrani, et al., 200325. m/0.25 mm/0.25 μm, N2, 4. K/min, 250. C @ 10. min; Tstart: 50. C
CapillaryDB-11473.Ahmadi, Mirza, et al., 200260. m/0.25 mm/0.25 μm, He, 4. K/min; Tstart: 50. C; Tend: 280. C
CapillaryCP Sil 5 CB1471.Azaz. D., Demirci, et al., 200225. m/0.25 mm/0.4 μm, N2, 5. K/min, 260. C @ 40. min; Tstart: 60. C
CapillaryDB-51477.Bos, Koulman, et al., 200230. m/0.249 mm/0.25 μm, He, 3. K/min, 300. C @ 5. min; Tstart: 60. C
CapillaryOV-1011486.Boyom, Keumedjio, et al., 20025. K/min; Column length: 25. m; Column diameter: 0.32 mm; Tstart: 50. C; Tend: 200. C
CapillaryDB-51474.Caredda, Marongiu, et al., 200230. m/0.25 mm/0.25 μm, He, 3. K/min, 280. C @ 30. min; Tstart: 60. C
CapillaryHP-11467.Cavaleiro, Salgueiro, et al., 2002, 230. m/0.25 mm/0.25 μm, He, 3. K/min, 220. C @ 15. min; Tstart: 70. C
Capillary5 % Phenyl methyl siloxane1485.Cicció and Gómez-Laurito, 200230. m/0.25 mm/0.25 μm, He, 75. C @ 4. min, 3. K/min, 200. C @ 8. min
CapillaryDB-5MS1483.Congiu, Falconieri, et al., 200230. m/0.25 mm/0.25 μm, He, 3. K/min; Tstart: 60. C; Tend: 280. C
CapillaryDB-5MS1483.Congiu, Falconieri, et al., 200230. m/0.25 mm/0.25 μm, He, 3. K/min; Tstart: 60. C; Tend: 280. C
CapillaryBP-11480.Das, Ram, et al., 200225. m/0.50 mm/0.25 μm, N2, 5. K/min, 220. C @ 10. min; Tstart: 60. C
CapillaryDB-51482.Flamini, Ertugrul, et al., 200230. m/0.25 mm/0.25 μm, He, 3. K/min; Tstart: 60. C; Tend: 240. C
CapillaryDB-11452.Gancel, Ollé, et al., 200230. m/0.32 mm/0.25 μm, H2, 40. C @ 20. min, 3. K/min; Tend: 245. C
CapillarySE-301485.Iñigo, Palá-Paúl, et al., 200250. m/0.25 mm/0.25 μm, He, 4. K/min; Tstart: 70. C; Tend: 240. C
CapillaryRSL-2001487.Jirovetz, Buchbauer, et al., 200230. m/0.32 mm/0.25 μm, H2, 40. C @ 5. min, 6. K/min, 280. C @ 5. min
CapillaryRSL-2001475.Jirovetz, Ngassoum, et al., 200230. m/0.32 mm/0.25 μm, H2, 50. C @ 5. min, 6. K/min, 280. C @ 5. min
CapillaryCP Sil 8 CB1484.Juteau, Masotti, et al., 200230. m/0.25 mm/0.25 μm, He, 50. C @ 2. min, 3. K/min; Tend: 220. C
CapillaryDB-51485.Kabouss, Charrouf, et al., 200230. m/0.25 mm/0.25 μm, 40. C @ 2. min, 2. K/min, 210. C @ 33. min
CapillaryDB-11472.Khallouki, Younos, et al., 200225. m/0.23 mm/0.20 μm, He, 50. C @ 3. min, 3. K/min, 200. C @ 30. min
CapillaryDB-51479.Kobaisy, Tellez, et al., 200230. m/0.25 mm/0.25 μm, He, 3. K/min; Tstart: 60. C; Tend: 240. C
CapillaryDB-51488.Krauze-Baranowska, Mardarowicz, et al., 200230. m/0.25 mm/0.25 μm, He, 35. C @ 2. min, 3. K/min, 280. C @ 15. min
CapillaryOV-1011487.Kuiate, Bessière, et al., 2002He, 5. K/min; Column length: 25. m; Column diameter: 0.32 mm; Tstart: 50. C; Tend: 200. C
CapillaryDB-51476.Limberger, Simões-Pires, et al., 200230. m/0.25 mm/0.25 μm, He, 3. K/min; Tstart: 60. C; Tend: 250. C
CapillaryHP-51472.Lockwood, Asghari, et al., 200230. m/0.25 mm/0.25 μm, 60. C @ 4. min, 4. K/min; Tend: 275. C
CapillaryDB-51479.Mahmout, Bessière, et al., 200225. m/0.23 mm/0.15 μm, N2, 3. K/min; Tstart: 50. C; Tend: 250. C
CapillaryDB-51480.Maia, da Silva, et al., 200230. m/0.25 mm/0.25 μm, He, 3. K/min; Tstart: 60. C; Tend: 240. C
CapillaryDB-5MS1480.Maia, Zoghbi, et al., 200230. m/0.25 mm/0.25 μm, He, 3. K/min; Tstart: 60. C; Tend: 240. C
CapillaryOV-1011478.Menut, Bessière, et al., 2002He, 5. K/min; Column length: 25. m; Column diameter: 0.32 mm; Tstart: 50. C; Tend: 200. C
CapillaryCP Sil 5 CB1480.Monfared, Davarani, et al., 2002He, 5. K/min; Column length: 25. m; Column diameter: 0.25 mm; Tstart: 60. C; Tend: 220. C
CapillaryDB-11486.Norouzi-Arasi, Yavari, et al., 200230. m/0.25 mm/0.25 μm, He, 60. C @ 10. min, 4. K/min; Tend: 250. C
CapillaryOV-1011470.Orav, Kailas, et al., 200250. m/0.2 mm/0.5 μm, He, 2. K/min; Tstart: 50. C; Tend: 250. C
CapillaryDB-11464.Palá-Paúl, Pérez-Alonso, et al., 2002, 250. m/0.25 mm/0.25 μm, N2, 4. K/min; Tstart: 80. C; Tend: 225. C
CapillaryDB-5MS1489.Phutdhawong, Korth, et al., 200230. m/0.32 mm/0.25 μm, He, 4. K/min, 280. C @ 5. min; Tstart: 40. C
CapillaryHP-11475.Priestap, van Baren, et al., 200250. m/0.25 mm/0.25 μm, N2, 3. K/min; Tstart: 90. C; Tend: 220. C
CapillaryDB-51486.Schwob, Bessière, et al., 2002He, 3. K/min; Column length: 25. m; Column diameter: 0.2 mm; Tstart: 60. C; Tend: 220. C
CapillaryDB-11476.Sefidkon, Dabiri, et al., 2002He, 4. K/min; Column length: 60. m; Column diameter: 0.25 mm; Tstart: 40. C; Tend: 250. C
CapillaryDB-11474.Sefidkon, 200260. m/0.25 mm/0.25 μm, He, 40. C @ 5. min, 4. K/min; Tend: 280. C
CapillaryDB-11451.Velasco-Negueruela, Pérez-Alonso, et al., 200250. m/0.25 mm/0.25 μm, N2, 3. K/min; Tstart: 60. C; Tend: 240. C
CapillaryHP-51480.Velickovic, Randjelovic, et al., 200230. m/0.25 mm/0.25 μm, H2, 4. K/min; Tstart: 40. C; Tend: 280. C
CapillaryDB-11495.Yamini, Sefidkon, et al., 200260. m/0.25 mm/0.25 μm, He, 50. C @ 5. min, 4. K/min; Tend: 250. C
CapillaryDB-5MS1481.Zoghbi, Andrade, et al., 200230. m/0.25 mm/0.25 μm, He, 3. K/min; Tstart: 60. C; Tend: 270. C
CapillaryDB-51483.Zoghbi, Andrade, et al., 2002, 230. m/0.25 mm/0.25 μm, He, 3. K/min; Tstart: 60. C; Tend: 240. C
CapillaryDB-11485.Bailac, Dellacasa, et al., 200160. m/0.248 mm/0.25 μm, N2, 60. C @ 5. min, 3. K/min, 220. C @ 22. min
CapillaryOptima-11470.Brun, Bessière, et al., 200125. m/0.20 mm/0.25 μm, He, 50. C @ 3. min, 3. K/min; Tend: 250. C
CapillaryHP-51481.Campeol, Flamini, et al., 200130. m/0.25 mm/0.25 μm, N2, 60. C @ 10. min, 5. K/min; Tend: 220. C
CapillarySPB-51487.Cornu, Carnat, et al., 2001He, 40. C @ 5. min, 3. K/min, 220. C @ 15. min; Column length: 60. m; Column diameter: 0.32 mm
CapillaryDB-11481.Dabiri and Sefidkon, 200160. m/0.25 mm/0.25 μm, He, 40. C @ 5. min, 4. K/min; Tend: 280. C
CapillaryDB-11483.Dabiri and Sefidkon, 200160. m/0.25 mm/0.25 μm, He, 40. C @ 5. min, 4. K/min; Tend: 280. C
CapillaryHP-51481.Flamini, Cioni, et al., 200130. m/0.25 mm/0.25 μm, N2, 60. C @ 10. min, 5. K/min; Tend: 220. C
CapillaryHP-51481.Gallori, Flamini, et al., 200130. m/0.25 mm/0.25 μm, N2, 60. C @ 10. min, 5. K/min; Tend: 220. C
CapillaryBP-11480.Gupta, Mallavarapu, et al., 200130. m/0.25 mm/0.25 μm, N2, 5. K/min; Tstart: 60. C; Tend: 220. C
CapillaryOptima-51484.Jacquemond-Collet, Bessière, et al., 2001He, 50. C @ 3. min, 3. K/min; Column length: 30. m; Column diameter: 0.2 mm; Tend: 250. C
CapillaryRTX-11482.Kalemba, Marschall, et al., 200130. m/0.25 mm/0.25 μm, N2, 4. K/min; Tstart: 60. C; Tend: 300. C
CapillaryCBP-11483.Ly, Yamauchi, et al., 200125. m/0.25 mm/0.25 μm, Nitrogen, 50. C @ 2. min, 3. K/min; Tend: 210. C
CapillaryDB-11471.Mirza, Ahmadi, et al., 200160. m/0.25 mm/0.25 μm, He, 4. K/min; Tstart: 50. C; Tend: 270. C
CapillaryOV-1011471.Orav, Kailas, et al., 200150. m/0.2 mm/0.5 μm, He, 2. K/min; Tstart: 50. C; Tend: 250. C
CapillaryOV-1011470.Orav and Kann, 2001He, 2. K/min; Column length: 50. m; Column diameter: 0.2 mm; Tstart: 50. C; Tend: 250. C
CapillaryDB-11450.Palá-Paúl, Pérez-Alonso, et al., 200130. m/0.25 mm/0.25 μm, N2, 4. K/min; Tstart: 80. C; Tend: 225. C
CapillaryDB-51480.Rousis, Papadogianni, et al., 2001He, 50. C @ 5. min, 3. K/min; Column length: 60. m; Column diameter: 0.25 mm; Tend: 250. C
CapillaryDB-51477.Santos-Gomes and Fernandes-Ferreira, 200130. m/0.25 mm/0.25 μm, H2, 3. K/min; Tstart: 60. C; Tend: 285. C
CapillaryDB-11483.0Santos, Moreira, et al., 2001He, 3. K/min; Column length: 30. m; Column diameter: 0.2 mm; Tstart: 60. C; Tend: 240. C
CapillaryCP Sil 5 CB1478.Sayyah, Kamalinejad, et al., 200125. m/0.25 mm/0.39 μm, He, 5. K/min; Tstart: 60. C; Tend: 220. C
CapillaryCP-Sil 5 CB1478.Sayyah, Kamalinejad, et al., 2001, 225. m/0.25 mm/0.39 μm, Nitrogen, 5. K/min; Tstart: 60. C; Tend: 220. C
CapillaryHP-5 MS1484.Shang, Hu, et al., 200130. m/0.25 mm/0.25 μm, Helium, 50. C @ 2. min, 5. K/min, 250. C @ 5. min
CapillaryPTE-51480.Stojanovic, Palic, et al., 200160. m/0.32 mm/0.3 μm, H2, 4.3 K/min; Tstart: 60. C; Tend: 285. C
CapillaryDB-51479.Tellez M., Estell R., et al., 200130. m/0.25 mm/0.25 μm, He, 3. K/min; Tstart: 60. C; Tend: 240. C
CapillaryCP Sil 5 CB1472.Baser, Özek, et al., 200025. m/0.25 mm/0.4 μm, He, 60. C @ 40. min, 5. K/min; Tend: 260. C
CapillaryCP Sil 5 CB1472.Baser, Özek, et al., 200025. m/0.25 mm/0.4 μm, He, 60. C @ 40. min, 5. K/min; Tend: 260. C
CapillaryDB-11490.Feger, Brandauer, et al., 200033. m/0.25 mm/0.50 μm, N2, 50. C @ 2. min, 20. K/min; Tend: 135. C
CapillaryRSL-2001471.Jirovetz, Puschmann, et al., 200060. m/0.32 mm/0.25 μm, H2, 6. K/min; Tstart: 40. C; Tend: 250. C
CapillaryDB-51470.Mitiku, Sawamura, et al., 200030. m/0.22 mm/0.25 μm, N2, 70. C @ 2. min, 4. K/min, 230. C @ 20. min
CapillaryBP-11473.Mohagheghzadeh, Shams-Ardakani, et al., 200025. m/0.33 mm/1.0 μm, N2, 4. K/min; Tstart: 60. C; Tend: 275. C
CapillaryOV-1011480.Tamura, Boonbumrung, et al., 2000Nitrogen, 40. C @ 10. min, 2. K/min; Column length: 50. m; Column diameter: 0.25 mm; Tend: 200. C
CapillaryOV-1011481.Ayedoun, Adéoti, et al., 1999N2, 5. K/min; Column length: 25. m; Column diameter: 0.25 mm; Tstart: 50. C; Tend: 200. C
CapillaryDB-11492.Bailac, Dellacasa, et al., 199960. m/0.25 mm/0.25 μm, N2, 75. C @ 1. min, 4. K/min, 220. C @ 8. min
CapillaryOV-11453.Bicchi, Binello, et al., 199925. m/0.32 mm/0.30 μm, Hydrogen, 50. C @ 1. min, 3. K/min, 200. C @ 10. min
CapillaryOV-11453.Bicchi, Binello, et al., 199925. m/0.32 mm/0.30 μm, Hydrogen, 50. C @ 1. min, 3. K/min, 200. C @ 10. min
CapillaryOV-11454.Bicchi, Binello, et al., 199925. m/0.32 mm/0.30 μm, Hydrogen, 50. C @ 1. min, 3. K/min, 200. C @ 10. min
CapillaryOV-11455.Bicchi, Binello, et al., 199925. m/0.32 mm/0.30 μm, Hydrogen, 50. C @ 1. min, 3. K/min, 200. C @ 10. min
CapillaryRTX-11480.Kalemba, 199930. m/0.25 mm/0.25 μm, N2, 4. K/min; Tstart: 60. C; Tend: 300. C
CapillaryDB-11477.Koulman, 199925. m/0.25 mm/0.25 μm, He, 4. K/min; Tstart: 50. C; Tend: 290. C
CapillaryOV-1011487.Kuiate, Zollo, et al., 1999, 25. K/min; Column length: 25. m; Column diameter: 0.32 mm; Tstart: 50. C; Tend: 200. C
CapillaryOV-1011491.Menon, Chacko, et al., 1999N2, 1. K/min, 200. C @ 20. min; Column length: 50. m; Column diameter: 0.2 mm; Tstart: 80. C
CapillaryOV-11462.Oberhofer, Nikiforov, et al., 199925. m/0.25 mm/0.25 μm, H2, 40. C @ 5. min, 3. K/min, 220. C @ 5. min
CapillaryDB-11450.Palá-Paúl, Pérez-Alonso, et al., 199950. m/0.25 mm/0.25 μm, He, 4. K/min; Tstart: 70. C; Tend: 240. C
CapillaryCP Sil 5 CB1481.Rustaiyan, Masoudi, et al., 199925. m/0.25 mm/0.39 μm, He, 60. C @ 5. min, 5. K/min, 220. C @ 20. min
CapillaryCP Sil 5 CB1457.Rycroft, Cole, et al., 199925. m/0.32 mm/0.12 μm, He, 80. C @ 2. min, 5. K/min, 275. C @ 10. min
CapillaryDB-11481.Sefidkon, Dabiri, et al., 199960. m/0.25 mm/0.25 μm, He, 40. C @ 5. min, 4. K/min; Tend: 280. C
CapillaryDB-11485.Sefidkon and Mirza, 199960. m/0.25 mm/0.25 μm, He, 4. K/min; Tstart: 50. C; Tend: 220. C
CapillaryDB-51480.Tellez, Canel, et al., 199930. m/0.25 mm/0.25 μm, He, 3. K/min; Tstart: 60. C; Tend: 240. C
CapillaryOV-1011460.Camciuc, Bessière, et al., 199850. m/0.22 mm/1. μm, He, 100. C @ 1. min, 1. K/min; Tend: 220. C
CapillarySPB-51491.Doneanu and Anitescu, 199850. m/0.32 mm/0.25 μm, He, 3. K/min, 240. C @ 20. min; Tstart: 60. C
CapillaryDB-51480.El-Sakhawy, El-Tantawy, et al., 199830. m/0.25 mm/0.25 μm, He, 3. K/min; Tstart: 60. C; Tend: 240. C
CapillaryOV-11476.Kökdil, Kurucu, et al., 199850. m/0.32 mm/0.25 μm, He, 50. C @ 5. min, 10. K/min, 250. C @ 20. min
CapillaryDB-51482.Maia, Zohhbi, et al., 199830. m/0.25 mm/0.25 μm, He, 3. K/min; Tstart: 60. C; Tend: 240. C
CapillaryHP-51501.Poiana, Sicari, et al., 199825. m/0.2 mm/0.33 μm, He, 70. C @ 8. min, 3. K/min, 290. C @ 20. min
CapillaryDB-51481.Santos, Andrade, et al., 1998, 230. m/0.25 mm/0.25 μm, Helium, 3. K/min; Tstart: 60. C; Tend: 240. C
CapillaryHP-11473.Stashenko, Cervantes, et al., 199860. m/0.25 mm/0.25 μm, He, 50. C @ 5. min, 4. K/min; Tend: 280. C
CapillaryOV-1011481.Zollo, Biyiti, et al., 19985. K/min; Column length: 25. m; Column diameter: 0.32 mm; Tstart: 50. C; Tend: 200. C
CapillaryCP Sil 5 CB1465.Bos, Woerdenbag, et al., 199725. m/0.25 mm/0.25 μm, He, 6. K/min; Tstart: 60. C; Tend: 300. C
CapillaryDB-51464.Elias, Simoneit, et al., 199730. m/0.25 mm/0.25 μm, He, 65. C @ 2. min, 4. K/min; Tend: 300. C
CapillaryOV-11461.Kökdil, Kurucu, et al., 199730. m/0.32 mm/0.25 μm, He, 40. C @ 4. min, 2. K/min; Tend: 270. C
CapillaryOV-11460.Kökdil, Tanker, et al., 199730. m/0.32 mm/0.25 μm, 40. C @ 4. min, 2. K/min; Tend: 270. C
CapillaryDB-11474.Salgueiro, Vila, et al., 19976. K/min; Tstart: 80. C; Tend: 220. C
CapillaryDB-51480.Tellez, Estell, et al., 1997, 230. m/0.25 mm/0.25 μm, Helium, 3. K/min; Tstart: 60. C; Tend: 240. C
CapillaryDB-51480.Zunino, Novillo-Newton, et al., 1997He, 4. K/min; Column length: 30. m; Column diameter: 0.25 mm; Tstart: 60. C; Tend: 240. C
CapillaryHP-11470.Ayedoun, Adeoti, et al., 199623. m/0.32 mm/0.17 μm, He, 60. C @ 3. min, 5. K/min, 250. C @ 30. min
CapillaryDB-11473.Sagrero-Nieves and Bartley, 199660. m/0.32 mm/0.50 μm, He, 50. C @ 1. min, 8. K/min, 250. C @ 6. min
CapillaryDB-11486.Stashenko, Puertas, et al., 199660. m/0.25 mm/0.25 μm, He, 50. C @ 5. min, 2.5 K/min; Tend: 250. C
CapillaryHP-11470.Thanh, Dung, et al., 199625. m/0.32 mm/0.25 μm, Helium, 60. C @ 2. min, 4. K/min, 220. C @ 20. min
CapillaryDB-11475.Stashenko, Torres, et al., 199560. m/0.25 mm/0.25 μm, He, 50. C @ 5. min, 3.5 K/min; Tend: 250. C
CapillaryDB-11477.Tirado, Stashenko, et al., 199560. m/0.25 mm/0.25 μm, He, 70. C @ 5. min, 2.5 K/min; Tend: 270. C
CapillaryOV-11485.Ramanoelina, Viano, et al., 199450. m/0.27 mm/0.2 μm, N2, 3. K/min; Tstart: 80. C; Tend: 240. C
CapillaryHP-51481.Collin, Deslauriers, et al., 19932. K/min; Tstart: 40. C; Tend: 210. C
CapillaryHP-51482.Collin, Deslauriers, et al., 19932. K/min; Tstart: 40. C; Tend: 210. C
CapillaryHP-1011467.Demarne and van der Walt, 199350. m/0.32 mm/0.3 μm, H2, 65. C @ 5. min, 2. K/min; Tend: 300. C
CapillaryMethyl Silicone1469.Gopalakrishnan, Menon, et al., 199350. m/0.25 mm/0.17 μm, N2, 2. K/min; Tstart: 80. C; Tend: 200. C
CapillaryMethyl Silicone1469.Gopalakrishnan, Menon, et al., 199350. m/0.25 mm/0.17 μm, N2, 3. K/min; Tstart: 80. C; Tend: 200. C
CapillaryOV-1011468.Tkachenko and Zenkevich, 1993Helium, 40. C @ 0. min, 3. K/min, 200. C @ 0. min; Column length: 52. m; Column diameter: 0.26 mm
CapillaryOV-1011466.Tkachenko and Zenkevich, 1993, 2Helium, 40. C @ 0. min, 3. K/min, 200. C @ 0. min; Column length: 52. m; Column diameter: 0.26 mm
CapillarySE-541473.Kollmannsberger, Nitz, et al., 199230. m/0.25 mm/0.25 μm, Hydrogen, 60. C @ 5. min, 2. K/min, 250. C @ 2. min
CapillaryDB-11485.Peppard, 199230. m/0.25 mm/1.0 μm, He, 3. K/min, 250. C @ 30. min; Tstart: 40. C
CapillaryDB-11490.Peppard, 199230. m/0.25 mm/1.0 μm, He, 3. K/min, 250. C @ 30. min; Tstart: 40. C
CapillaryDB-11473.Velasco-Negueruela, Pérez Alonso, et al., 1991N2, 4. K/min; Column length: 30. m; Tstart: 80. C; Tend: 220. C
CapillaryDB-11473.Binder, Benson, et al., 19904. K/min, 230. C @ 10. min; Column length: 60. m; Column diameter: 0.32 mm; Tstart: 50. C
CapillaryDB-11473.Binder, Turner, et al., 19904. K/min, 230. C @ 10. min; Tstart: 50. C
CapillaryDB-11473.Binder, Turner, et al., 1990, 24. K/min, 230. C @ 10. min; Column length: 60. m; Column diameter: 0.32 mm; Tstart: 50. C
CapillaryRSL-1501472.Ronse and De Pooter, 199030. m/0.32 mm/0.20 μm, 3. K/min; Tstart: 30. C; Tend: 200. C
CapillaryOV-1011487.Yang and Sugisawa, 1990N2, 2. K/min; Column length: 50. m; Column diameter: 0.25 mm; Tstart: 80. C; Tend: 200. C
CapillaryOV-1011487.Yang and Sugisawa, 1990N2, 2. K/min; Column length: 50. m; Column diameter: 0.25 mm; Tstart: 80. C; Tend: 200. C
CapillaryDB-11472.Binder and Flath, 198950. C @ 0.1 min, 4. K/min, 250. C @ 5. min; Column length: 60. m; Column diameter: 0.32 mm
CapillaryOV-11472.de Pooter, Nicolai, et al., 198850. m/0.20 mm/0.20 μm, He, 2. K/min; Tstart: 30. C; Tend: 220. C
CapillarySE-301468.Ramaswami, Briscese, et al., 198850. C @ 2. min, 4. K/min, 240. C @ 10. min; Column length: 30. m
CapillaryOV-31495.Buttery, Flath, et al., 1986He, 1. K/min; Column length: 150. m; Column diameter: 0.66 mm; Tstart: 30. C; Tend: 170. C
CapillaryOV-1011475.Nykanen, 198640. C @ 5. min, 3.5 K/min; Column length: 50. m; Column diameter: 0.30 mm; Tend: 230. C
CapillaryOV-1011492.Nykanen, 198640. C @ 5. min, 3.5 K/min; Column length: 50. m; Column diameter: 0.30 mm; Tend: 230. C
CapillaryOV-1011496.Nykanen, 198640. C @ 5. min, 3.5 K/min; Column length: 50. m; Column diameter: 0.30 mm; Tend: 230. C
CapillaryOV-11470.de Pooter, de Buyck, et al., 198640. m/0.5 mm/0.75 μm, He, 3. K/min; Tstart: 30. C; Tend: 220. C
CapillaryOV-11473.De Pooter, De Buyck, et al., 1986He, 2. K/min; Tstart: 40. C; Tend: 220. C
CapillaryOV-1011471.De Pooter and Schamp, 198630. m/0.5 mm/0.8 μm, He, 2. K/min; Tstart: 40. C; Tend: 220. C
CapillaryOV-1011471.De Pooter and Schamp, 198630. m/0.5 mm/0.8 μm, He, 2. K/min; Tstart: 40. C; Tend: 220. C
CapillaryOV-1011472.De Pooter and Schamp, 198630. m/0.5 mm/0.8 μm, He, 2. K/min; Tstart: 40. C; Tend: 220. C
CapillarySE-301468.Ramaswami, Briscese, et al., 198650. C @ 2. min, 4. K/min, 240. C @ 10. min; Column length: 30. m

Normal alkane RI, non-polar column, custom temperature program

View large format table.

Column type Active phase I Reference Comment
CapillaryRTX-5 MS1480.Pinheiro, de Queiros, et al., 2013Helium; Column length: 30. m; Column diameter: 0.25 mm; Program: not specified
CapillaryDB-51484.Rodriques, Amorim, et al., 201330. m/0.25 mm/0.25 μm, Helium; Program: not specified
CapillaryDB-11474.Albano, Lima, et al., 201230. m/0.25 mm/0.25 μm, Hydrogen; Program: 45 0C 3 0C/min -> 175 0C 15 0C/min -> 300 0C (10 min)
CapillaryRTX-11476.Bendiabdellah, El Amine Dib, et al., 201260. m/0.22 mm/0.25 μm, Helium; Program: not specified
CapillaryRTX-11476.Bendiabdellah, El Amine Dib, et al., 201260. m/0.22 mm/0.25 μm, Helium; Program: not specified
CapillaryMega-51485.Dell'Agli, Sanna, et al., 201225. m/0.25 mm/0.25 μm, Helium; Program: not specified
CapillarySLB-5 MS1480.Mondello, 201230. m/0.25 mm/0.25 μm, Helium; Program: not specified
CapillarySLB-5 MS1487.Mondello, 201230. m/0.25 mm/0.25 μm, Helium; Program: not specified
CapillaryHP-5 MS1481.Sharopov, Sulaimonova, et al., 201230. m/0.25 mm/0.25 μm, Helium; Program: 40 0C (10 min) 3 0C/min -> 200 0C 2 0C/min -> 220 0C
CapillaryPolydimethyl siloxane with 5 % Ph groups1479.da Silva, de Souza, et al., 201230. m/0.25 mm/0.25 μm, Helium; Program: 50 0C 4 0C/min -> 200 0C (5 min) 20 0C/min -> 280 0C
Capillary5 % Phenyl polydimethyl siloxane1480.Chaverri, Diaz, et al., 2011Program: not specified
CapillaryHP-5 MS1477.Chu, Liu, et al., 201130. m/0.25 mm/0.25 μm, Helium; Program: 60 0C (1 min) 10 0C -> 180 0C (1 min) 20 0C/min -> 280 0C (15 min)
CapillaryCBP-51483.Fortes, Naves, et al., 201130. m/0.25 mm/0.25 μm, Helium; Program: 60 0C 3 0C/min -> 246 0C 10 0C/min -> 270 0C (5 min)
Capillary 1482.Karimi, Farmany, et al., 2011Program: not specified
CapillaryHP-51480.Laribi, Kouki, et al., 201130. m/0.25 mm/0.25 μm, Nitrogen; Program: 35 0C (10 min) 3 0C/min -> 205 0C 10 0C/min -> 225 0C
CapillaryHP-5 MS1480.Payo, Colo, et al., 2011Program: not specified
CapillaryHP-5 MS1480.Payo, Colo, et al., 2011Program: not specified
CapillaryZB-51492.Vazques, Aimar, et al., 201130. m/0.25 mm/0.25 μm, Nitrogen; Program: not specified
CapillaryZB-51492.Vazquez, Demmel, et al., 201130. m/0.25 mm/0.25 μm, Nitrogen; Program: not specified
CapillaryHP-5 MS1436.Bagci, Yazgin, et al., 201030. m/0.25 mm/0.25 μm, Helium; Program: 70 0C (2 min) 10 0C/min -> 150 0C (15 min) 5 0C/min -> 240 0C
CapillaryHP-5 MS1468.Bamoniri, Mirjalili, et al., 201030. m/0.25 mm/0.25 μm, Helium; Program: 50 0C (2 min) 3 0C/min -> 130 0C (2 min) 5 0C/min -> 270 0C
CapillaryHP-51485.Bi Kouame, Bedi, et al., 201030. m/0.25 mm/0.25 μm, Helium; Program: not specified
CapillaryRTx-11472.Dib, Bendahou, et al., 201060. m/0.22 mm/0.25 μm, Helium; Program: not specified
CapillaryRTX-11478.Dib, Djabou, et al., 201060. m/0.22 mm/0.25 μm, Helium; Program: not specified
CapillaryHP-51485.Kahriman, Tosun, et al., 201030. m/0.32 mm/0.25 μm, Helium; Program: not specified
CapillaryHP-5 MS1479.Liu, Chu, et al., 201030. m/0.25 mm/0.25 μm, Helium; Program: 60 0C (1 min) 10 0C/min -> 180 0C (1 min) 20 0C/min -> 280 0C (15 min)
CapillaryHP-5 MS1479.Liu, Chu, et al., 201030. m/0.25 mm/0.25 μm, Helium; Program: 60 0C (1 min) 10 0C/min -> 180 0C (1 min) 20 0C/min -> 280 0C (15 min)
CapillarySLB-5 MS1480.Scandinaro, Tranchida, et al., 201010. m/0.10 mm/0.10 μm, Helium; Program: not specified
CapillaryDB-51480.Scherer, Wagner, et al., 201030. m/0.25 mm/0.25 μm, Helium; Program: not specified
CapillaryDB-11481.Xu, Tang, et al., 201030. m/0.25 mm/0.25 μm, Helium; Program: not specified
CapillaryDB-11481.Xu, Tang, et al., 201030. m/0.25 mm/0.25 μm, Helium; Program: not specified
CapillaryDB-51487.Courtois, Paine, et al., 200930. m/0.25 mm/0.25 μm, Helium; Program: 50 0C m6 0C/min -> 140 0C 5 0C/min -> 160 0C (1 min) 10 0C/min -> 200 0C
CapillaryDB-11493.Delort and Jaquier, 200960. m/0.25 mm/0.25 μm, Helium; Program: 50 0C (5 min) 3 0C/min -> 120 0C 5 0C/min -> 250 0C (3 min) 15 0C/min -> 300 0C (20 min)
CapillaryOptima-5MS1478.HEuskin, Godin, et al., 200930. m/0.32 mm/0.25 μm, Helium; Program: 40 0C (5 min) 5 0C/min -> 230 0C 30 0C/min -> 280 0C (5 min)
CapillaryElite-5 MS1482.Kapoor, Singh, et al., 200930. m/0.25 mm/0.25 μm, Helium; Program: 60 0C (1 min) 1.5 0C/min -> 185 0C (1 min) 9 0C/min -> 275 0C (2 min)
CapillaryHP-51477.Maggi, Bilek, et al., 200925. m/0.32 mm/0.17 μm, Helium; Program: 60 0C (5 min) 4 0C/min -> 220 0C 11 0C/min -> 280 0C
CapillaryHP-5 MS1477.Mancini, Arnold, et al., 200930. m/0.25 mm/0.25 μm, Helium; Program: 40 0C (5 min) 2 0C/min -> 270 0C -> 260 0C (20 min)
CapillaryDB-11474.Mendes, Trindade, et al., 200930. m/0.25 mm/0.25 μm, Hydrogen; Program: 45 0C 3 0C/min -> 175 0C 15 0C/min -> 300 0C (10 min)
CapillaryDB-51464.Porto, Decorti, et al., 200930. m/0.25 mm/0.25 μm, Helium; Program: not specified
CapillaryDB-51487.Porto, Decorti, et al., 200930. m/0.25 mm/0.25 μm, Helium; Program: not specified
CapillaryHP-51479.Riahi, Pourbasheer, et al., 2009Column length: 30. m; Column diameter: 0.32 mm; Program: not specified
CapillaryDB-5 MS1488.Su, Wang, et al., 200930. m/0.25 mm/0.25 μm, Helium; Program: not specified
CapillaryDB-51487.Chieng, Assim, et al., 200825. m/0.22 mm/0.25 μm, Nitrogen; Program: not specified
CapillaryHP-51480.Isidorov, Lech, et al., 200830. m/0.25 mm/0.25 μm, Helium; Program: not specified
CapillaryCP Sil 8 CB1480.Kristiawan, Sobolik, et al., 200830. m/0.25 mm/0.25 μm; Program: 60C => 2.5C/min => 170C => 10C/min => 250C (5min)
CapillaryCP Sil 8 CB1485.Kupcinskiene, Stikliene, et al., 200850. m/0.32 mm/0.25 μm, Helium; Program: not specified
CapillarySLB-5 MS1480.Lo Presti, Sciarrone, et al., 200830. m/0.25 mm/0.25 μm, Helium; Program: not specified
CapillaryDB-11474.Nogueira, Marcelo-Curto, et al., 200830. m/0.25 mm/0.25 μm, He; Program: 45C => 3C/min => 175C => 15C/min => 300C (10min)
CapillaryCP-Sil 8CB-MS1484.Profitt, Schatz, et al., 200830. m/0.25 mm/0.25 μm, Helium; Program: 50 0C(3 min) 3 0C/min -> 100 0C 2.7 0C/min -> 140 0C 2.4 0C/min -> 180 0C 6 0C/min -> 260 0C
CapillaryHP-51482.Qiao, Xie, et al., 200830. m/0.25 mm/0.25 μm, Helium; Program: 40 0C (3 min) 3 0C/min -> 160 0C (2 min) 8 0C/min -> 220 0C (3 min)
CapillaryHP-51490.Qiao, Xie, et al., 200830. m/0.25 mm/0.25 μm, Helium; Program: not specified
CapillaryElite-11485.Raj, Baby, et al., 200830. m/0.32 mm/0.25 μm, Helium; Program: not specified
CapillaryDB-51486.Santos, Costa, et al., 2008Helium; Column length: 30. m; Column diameter: 0.25 mm; Program: 80 0C (2 min) 3 0C/min -> 180 0C 10 0C/min -> 300 0C (10 min)
CapillaryDB-51485.Santos, Costa, et al., 2008Helium; Column length: 30. m; Column diameter: 0.25 mm; Program: not specified
CapillaryBPX-51480.Shellie, 20087.5 m/0.10 mm/10. μm, Helium; Program: not specified
CapillaryDB-5 MS1484.Silva, Doria, et al., 200830. m/0.25 mm/0.25 μm; Program: 80 0C (1.5 min) 4 pC/min -> 180 0C 10 0C/min -> 300 0C (10 min)
CapillaryRTX-51489.Zachariah, Leela, et al., 200830. m/0.25 mm/0.25 μm, Helium; Program: 60 0C (5 min) 5 0C/min -> 110 0C 3 0C/min -> 220 0C (5 min)
CapillaryRTX-51485.Zachariah, Leela, et al., 200830. m/0.25 mm/0.25 μm, Helium; Program: not specified
Capillary5 % Phenyl methyl siloxane1519.Agabriel, Cornu, et al., 2007Program: not specified
CapillaryDB-51487.Albuquerque, Lemos, et al., 200730. m/0.25 mm/0.25 μm, He; Program: 35C => 4C/min => 180C => 10C/min => 250C
CapillaryDB-11485.Albuquerque, Vasconcelos Silva, et al., 200730. m/0.25 mm/0.1 μm, He; Program: 35C => 4C/min => 180C => 10C/min => 250C
CapillaryDB-5MS1478.Barra A., Coroneo V., et al., 200730. m/0.25 mm/0.25 μm, He; Program: 60C => 1C/min => 65C => 3C/min => 120C => 5C/min => 180C(5min) => 5C/min => 250C (20min)
CapillaryHP-5MS1483.Cole, Haber, et al., 200730. m/0.25 mm/0.25 μm, He; Program: 40C(10min) => 3C/min => 200C => 2C/min => 220C
CapillaryHP-51487.Duschatzky, Almeida, et al., 200730. m/0.25 mm/0.25 μm; Program: 75C(4min) => 5C/min => 135C => 1C/min => 220C => 10C/min => 280C
CapillaryHP-5 MS1481.Eason and Setzer, 200730. m/0.25 mm/0.25 μm, Helium; Program: 40 0C (10 min) 3 0C/min -> 200 0C 2 0C/min -> 220 0C
CapillaryDB-11474.Ferreira, Meireles de Sousa, et al., 200730. m/0.25 mm/0.25 μm, He; Program: 45C => 3C/min => 175C => 15C/min => 300C (10min)
CapillaryHP-5MS1477.Formisano, Mignola, et al., 200730. m/0.25 mm/0.25 μm, He; Program: 40C(5min) => 2C/min => 250C(15min) => 10C/min => 270C
CapillaryHP-5 MS1477.Formisano, Rigano, et al., 200730. m/0.25 mm/0.25 μm, Helium; Program: 40 0C (5 min) 2 0C/min -> 250 0C (15 min) 10 0C/min -> 270 0C
CapillaryBP-51475.Hashemi, Abolghasemi, et al., 200730. m/0.32 mm/0.25 μm, He; Program: 60C => 4C/min => 150C => 10C/min => 220C
CapillaryDB-5 MS1491.Haznagy-Radnai, Szigle, et al., 200730. m/0.25 mm/0.25 μm, Helium; Program: 60 0C 3 0C/min -> 210 0C 5 0C/min -> 250 0C
CapillaryHP-51475.Liolios, Laouer, et al., 2007Program: not specified
CapillaryHP-5MS1485.Liu, Song, et al., 200730. m/0.25 mm/0.25 μm, He; Program: 40C(3min) => 8C/min => 160C => 15C/min => 300C (10min)
CapillaryCP Sil 8 CB1480.Meekijjaroenroj, Bessière, et al., 200730. m/0.25 mm/0.25 μm, He; Program: 50C(3min) => 3C/min => 100C => 2.7C/min => 140C => 2.4C/min => 180C => 6C/min => 250C
CapillaryCP Sil 8 CB1485.Mockute, Bernotiene, et al., 200750. m/0.32 mm/0.25 μm, He; Program: 60 0C (2 min) 5 0C/min -> 160 0C 5 0C/min -> 250 0C (10 min)
CapillaryHP-5 MS1482.Moriarity, Bansal, et al., 200730. m/0.25 mm/0.25 μm, Helium; Program: 40 0C (10 min) 3 0C/min -> 200 0C 2 0C/min -> 220 0C
CapillaryHP-5 MS1484.Moriarity, Bansal, et al., 200730. m/0.25 mm/0.25 μm, Helium; Program: 40 0C (10 min) 3 0C/min -> 200 0C 2 0C/min -> 220 0C
CapillaryHP-5MS1481.Moronkola, Ogunwande, et al., 200730. m/0.25 mm/0.25 μm, He; Program: 40C(10min) => 3C/min => 200C => 2C/min => 220C
CapillaryDB-51485.Nivinsliene, Butkiene, et al., 200750. m/0.32 mm/0.25 μm, Helium; Program: 60 0C (1 min) 5 0C/min -> 160 0C 10 0C/min -> 250 0C
CapillaryCP-Sil1466.Proffit, 200730. m/0.25 mm/0.25 μm, Helium; Program: 50 0C (3 min) 3 0C/min -> 100 0C 2.7 0C/min -> 140 0C 2.4 0C/min -> 180 0C 6 0C/min -> 250 0C
CapillaryCP-Sil1476.Proffit, 200730. m/0.25 mm/0.25 μm, Helium; Program: 50 0C (3 min) 3 0C/min -> 100 0C 2.7 0C/min -> 140 0C 2.4 0C/min -> 180 0C 6 0C/min -> 250 0C
CapillaryCP-Sil1484.Proffit, 200730. m/0.25 mm/0.25 μm, Helium; Program: 50 0C (3 min) 3 0C/min -> 100 0C 2.7 0C/min -> 140 0C 2.4 0C/min -> 180 0C 6 0C/min -> 250 0C
CapillaryCP-Sil1484.Proffit, 200730. m/0.25 mm/0.25 μm, Helium; Program: 50 0C (3 min) 3 0C/min -> 100 0C 2.7 0C/min -> 140 0C 2.4 0C/min -> 180 0C 6 0C/min -> 250 0C
CapillaryCP Sil 8 CB1485.Radusiene, Judzentiene, et al., 200750. m/0.32 mm/0.25 μm, Helium; Program: 60 0C (2 min) 5 0C/min -> 160 0C (1 min) 10 0C/min -> 280 0C (3 min)
CapillaryHP-51485.Ristic, Krivokuca-Dokic, et al., 200730. m/0.25 mm/0.25 μm, Helium; Program: not specified
CapillaryDB-11474.Rodrigues, Antunes, et al., 200730. m/0.25 mm/0.25 μm, He; Program: 45C => 3C/min => 175C => 15C/min => 300C(10min)
CapillaryDB-51485.Santos, Santiago, et al., 200730. m/0.25 mm/0.25 μm, Hydrogen; Program: 35 0C 4 0C/min -> 180 0C 17 0C/min -> 280 0C (10 min)
Capillary5 % Phenyl methylsiloxane1516.Serrano, Cornu, et al., 2007Program: not specified
CapillaryHP-5 MS1480.Setzer, Stokes, et al., 2007Helium; Column length: 30. m; Column diameter: 0.25 mm; Program: 40 0C (10 min) 3 oC/min -> 200 0C 2 0C/min -> 220 0C
CapillaryHP-5 MS1483.Stokes, Cole, et al., 2007Program: not specified
CapillaryOV-11475.Suschke, Sporer, et al., 200730. m/0.25 mm/0.25 μm, Helium; Program: 40 0C (2 min) 6 0C/min -> 130 0C 10 0C/min -> 300 0C
CapillaryHP-5MS1481.Takaku, Haber, et al., 2007He; Column length: 30. m; Column diameter: 0.25 mm; Program: 40C(10min) => 3C/min => 200C => 2C/min => 220C
CapillaryPolydimethyl siloxane1481.Werka, Boehme, et al., 2007Program: not specified
CapillaryHP-5MS1480.Yu, Huang, et al., 200730. m/0.25 mm/0.25 μm, He; Program: 40C(3min) => 6C/min => 160C => 10C/min => 300C (10min)
CapillaryDB-51484.Albuquerque, Canuto, et al., 200630. m/0.25 mm/0.25 μm, He; Program: 35C => 4C/min => 180C => 10C/min => 250C
CapillaryHP-5MS1483.Deng, Xu, et al., 200630. m/0.25 mm/0.25 μm, He; Program: 50C(2min) => 6C/min => 200C => 10C/min => 270C(10min)
CapillaryHP-5MS1478.Formisano C., Senatore F., et al., 200630. m/0.25 mm/0.25 μm, He; Program: 40C(5min) => 2C/min => 250C(15min) => 10C/min => 270C
CapillaryHP-5MS1515.Güllüce, Özer, et al., 200630. m/0.25 mm/0.25 μm, He; Program: 50C(3min) => 3C/min => 150C(10min) => 10C/min => 250C
CapillaryCP Sil 8 CB1485.Judzentiene and Buzelyte, 200650. m/0.32 mm/0.25 μm, He; Program: 60C(2min) => 5C/min => 160C(1min) => 10C/min => 250C (5min)
CapillaryHP-5 MS1485.Kawaree, Phutdhawong, et al., 200630. m/0.25 mm/0.25 μm, HGelium; Program: 40 0C (3 min) 10 0C/min -> 108 0C 3 0C/min -> 188 0C 4 0C/min -> 280 0C (5 min)
CapillaryHP-51481.Kucuk, Gulec, et al., 200630. m/0.32 mm/0.25 μm, Helium; Program: not specified
CapillaryHP-5MS1476.Li, Deng, et al., 200630. m/0.25 mm/0.25 μm, He; Program: 40C(1min) => 8C/min => 160C => 12C/min => 300C(5min)
CapillaryCP Sil 8 CB1485.Mockute, Bernotiene, et al., 200650. m/0.32 mm/0.25 μm, He; Program: 60 0C (2 min) 5 0C/min -> 160 0C 10 0C/min -> 250 0C (5 min)
CapillarySPB-51480.Navickiene, Morandim, et al., 200630. m/0.25 mm/0.10 μm, Helium; Program: 40 0C (1 min) 10 0C/min -> 120 0C 0.5 0C/min -> 150 0C 20 0C/min -> 280 0C (5 min)
CapillaryDB-51489.Santos, Nunes, et al., 200630. m/0.25 mm/0.25 μm, He; Program: 35C => 4C/min => 180C => 10C/min => 250C
CapillaryHP-5 MS1481.Schmidt, Noletto, et al., 200630. m/0.25 mm/0.25 μm, Helium; Program: 40 0C (10 min) 3 0C/min -> 200 0C 2 0C/min -> 220 0C
CapillaryHP-5 MS1482.Schmidt, Noletto, et al., 200630. m/0.25 mm/0.25 μm, Helium; Program: 40 0C (10 min) 3 0C/min -> 200 0C 2 0C/min -> 220 0C
CapillaryHP-5 MS1481.Schmidt, Noletto, et al., 200630. m/0.25 mm/0.25 μm, Helium; Program: 40 0C (10 min) 3 0C/min -> 200 0C 2 0C/min -> 220 0C
CapillaryHP-5 MS1481.Schmidt, Noletto, et al., 200630. m/0.25 mm/0.25 μm, Helium; Program: 40 0C (10 min) 3 0C/min -> 200 0C 2 0C/min -> 220 0C
CapillaryHP-5MS1477.Senatore, Apostolides Arnold, et al., 200630. m/0.25 mm/0.25 μm, He; Program: 40C(5min) => 2C/min => 250C (15min) => 10C/min => 270C
CapillaryHP-5MS1484.Singh, Marimuthu, et al., 200630. m/0.25 mm/0.25 μm, He; Program: 60C => 1.5C/min => 185C(1min) => 9C/min => 275C(2min)
CapillaryDB-11481.Soumaghi, Amin, et al., 2006Helium; Program: not specified
CapillarySE-521485.Tognolini, Barocelli, et al., 200630. m/0.32 mm/0.15 μm, He; Program: 45C => 1C/min => 100C => 5C/min => 250C (10min)
CapillaryVF-5MS1481.Xie, Sun, et al., 200630. m/0.25 mm/0.25 μm, He; Program: 40C(1min) => 15C/min => 100C => 4C/min => 250C (1min)
CapillaryDB-5MS1463.Bagci and Baser, 200530. m/0.25 mm/0.25 μm; Program: 70C(2min) => 10C/min => 150C(15min) => 5C/min => 240C
CapillaryCP Sil 8 CB1485.Butkienë, Nivinskienë, et al., 200550. m/0.32 mm/0.25 μm, He; Program: 50C(5min) => 2C/min => 90C => 15C/min => 240C(4min)
CapillaryDB-51482.Cysne, Canuto, et al., 200530. m/0.25 mm/0.25 μm, He; Program: 35C => 4C/min => 180C => 10C/min => 250C
CapillaryHP-5MS1480.Deng, Yao, et al., 200530. m/0.25 mm/0.25 μm, He; Program: 50C => 8C/min => 200C => 10C/min => 270C (5min)
CapillaryDB-11474.Faleio, Miguel, et al., 200530. m/0.25 mm/0.25 μm, He; Program: 45C => 3C/min => 175C => 15C/min => 300C (10min)
CapillaryDB-11474.Figueiredo, Sim-Sim, et al., 200530. m/0.25 mm/0.25 μm, He; Program: 45C => 3C/min => 175C => 15C/min => 300C (10min)
CapillaryHP-5MS1480.Grombone-Guaratini, Silva-Brandão, et al., 200530. m/0.25 mm/0.25 μm, He; Program: not specified
CapillaryDB-51479.Hamm, Bleton, et al., 200530. m/0.25 mm/0.25 μm, He; Program: 40C(1min) => 9C/min => 130C => 2C/min => 230C
CapillaryHP-51493.Himanen, Vuorinen, et al., 200550. m/0.2 mm/0.5 μm, He; Program: 40C(1min) => 5C/min => 210C => 20C/min => 250C(8min)
CapillaryBPX-51480.Judzentiene and Mockute, 200530. m/0.25 mm/0.25 μm; Program: 60C(0.2min) => 3K/min => 186C => 10C/min => 240C (5min)
CapillaryCP Sil 8 CB1485.Nivinskienë, Butkienë, et al., 200550. m/0.32 mm/0.25 μm, He; Program: 60C(1min) => 5C/min => 160C => 5C/min => 250C(3min)
CapillaryHP-5MS1488.Novak, Draxler, et al., 200530. m/0.25 mm/0.25 μm; Program: 40C(5min) => 3C/min => 90C => 10C/min => 280C
CapillaryCP Sil 8 CB1485.Radudienë, Judpintienë, et al., 200550. m/0.32 mm/0.25 μm, He; Program: 60C(2min) => 5C/min => 160C(1min) => 10C/min => 250C (3min)
CapillaryHP-51480.Singh, Maurya, et al., 2005Column length: 30. m; Column diameter: 0.32 mm; Program: 65C(1min) => 1C/min => 75C (2min) => 0.5C/min => 81C(2min) => 3C/min => 180C(7min)
CapillaryCP Sil 8 CB1485.Butkienë, Nivinskienë, et al., 200450. m/0.32 mm/0.25 μm, He; Program: 50C(5min) => 2C/min => 90C => 15C/min => 240C(4min)
CapillaryDB-11472.Cavalcanti, de Morais, et al., 2004He; Column length: 30. m; Column diameter: 0.25 mm; Program: 35C => 4C/min => 180C => 10C/min => 250C
CapillaryMethyl Silicone1478.Couladis, Özcan, et al., 2004Program: not specified
CapillaryHP-5MS1480.Deng, Li, et al., 200430. m/0.25 mm/0.25 μm, He; Program: 60C => 10C/min => 160C => 12C/min => 300C (5min)
Capillary 1472.El-Shazily, Hafez, et al., 2004Program: not specified
CapillaryDB-51479.Hamm, Bleton, et al., 200430. m/0.25 mm/0.25 μm, He; Program: 40C(1min) => 9C/min => 130C => 2C/min => 230C
CapillaryCP Sil 8 CB1480.Judpentienë and Mockutë, 2004He; Column length: 50. m; Column diameter: 0.32 mm; Program: 60C(2min) => 5C/min => 160C (1min) => 10C/min => 250C (2min)
CapillaryBPX-51485.Koba, Sanda, et al., 200430. m/0.25 mm/0.25 μm, H2; Program: 50 0C (1 min) 3 0C/min -> 150 0C 5 0C/min -> 250 0C (5 min)
CapillaryDB-51503.Letchamo, Ward, et al., 200430. m/0.25 mm/0.25 μm, He; Program: 60C(4min) => 6C/min => 240 => 10C/min => 280C
CapillaryDB-11474.Miguel, Simões, et al., 200430. m/0.25 mm/0.25 μm, He; Program: 45C => 3C/min => 175C => 15C/min => 300C (10min)
CapillaryCP Sil 8 CB1480.Mockutë, Bernotienë, et al., 2004He; Column length: 50. m; Column diameter: 0.32 mm; Program: 50 0C (2 min) 3 0C/min -> 180 0C (1 min) 20 0C/min -> 250 0C (2 min)
CapillaryCP Sil 8 CB1480.Mockutë, Judbentienë, et al., 200450. m/0.32 mm/0.25 μm, He; Program: 50C(2min) => 3C/min => 180C(1min) => 20C/min => 250C (2min)
CapillaryHP-5MS1485.Sahin, Gulluce, et al., 200430. m/0.25 mm/0.25 μm, He; Program: 50C(3min) => 3C/min => 150C(10min) => 10C/min => 250C
CapillaryHP-51477.Senatore, Apostolides Arnold, et al., 200430. m/0.25 mm/0.25 μm; Program: 40C(5min) => 2C/min => 250C(15min) => 10C/min => 270C
CapillaryHP-5MS1480.Singh, Marimuthu, et al., 200430. m/0.25 mm/0.25 μm; Program: 60C(1min) => 1.5C/min => 185C(1min) => 9C/min => 275C(2min)
CapillaryHP-51485.Tepe, Donmez, et al., 200430. m/0.25 mm/0.25 μm, He; Program: 50C (3min) => 3C/min => 150C (10min) => 10C/min => 250C
CapillaryDB-11474.Touafek, Nacer, et al., 200430. m/0.25 mm/0.25 μm, He; Program: 45C => 3C/min => 175C => 15C/min => 300C (15min)
CapillaryDB-51480.Vilaseca, Guy, et al., 2004Program: not specified
CapillarySE-301474.Vinogradov, 2004Program: not specified
CapillaryDB-51479.Hamm, Lesellier, et al., 200330. m/0.25 mm/0.25 μm, He; Program: 40C (1min) => 9C/min => 130C => 2C/min => 230C
CapillarySE-541483.Lima, Veiga, et al., 200325. m/0.25 mm/0.25 μm, H2; Program: 110C(2min) => 3C/min => 130C => 8.5C => 290C
CapillaryCP-Sil 8CB-MS1480.Mockute, Bernotiene, et al., 2003Column length: 50. m; Column diameter: 0.32 mm; Program: 60C(1min) => 3C/min => 70C => 15C/min => 170C(8min) => 5C/min => 250C
CapillaryCP-Sil 8CB-MS1480.Mockute, Bernotiene, et al., 2003, 2He; Column length: 50. m; Column diameter: 0.32 mm; Program: 50C(2min) => 3C/min => 180C(1min) => 20C/min => 250C(2min)
CapillaryCP Sil 8 CB1480.Mockute and Judzentiene, 2003, 250. m/0.32 mm/0.25 μm, He; Program: 70C(5min) => 3C/min => 100C (1min) => 25C/min => 250C (10min)
CapillaryCP Sil 8 CB1480.Mockute, Nivinskiene, et al., 200350. m/0.32 mm/0.25 μm, He; Program: 60C(1min) => 5C/min => 160C => 10C/min => 250C(5min)
CapillaryDB-51478.5Veres, Varga, et al., 200330. m/0.25 mm/0.25 μm, He; Program: 60C => 3C/min => 210C => 5C/min => 250C(2min)
CapillarySE-541455.Kilic, 2002Program: not specified
CapillaryCP Sil 8 CB1480.Mockute and Judzentiene, 2002He; Column length: 50. m; Column diameter: 0.32 mm; Program: 60C(2min) => 5C/min => 160C(1min) => 10C/min => 250C (2min)
CapillaryCP Sil 8 CB1480.Mockute and Judzentiene, 2002, 2He; Column length: 50. m; Column diameter: 0.32 mm; Program: 60C(2min) => 5C/min => 160C(1min) => 10C/min => 250C(2min)
CapillaryHP-11506.Nogueira and Romano, 200230. m/0.32 mm/0.25 μm, He; Program: 40C(3min) => 5C/min => 180C => 15C/min => 240C(15min)
CapillaryDB-51485.Pessoa, Morais, et al., 200230. m/0.25 mm/0.1 μm, He; Program: 35C => 4C/min => 180C => 10C/min => 250C
CapillaryDB-5MS1488.Phutdhawong, Korth, et al., 200230. m/0.32 mm/0.25 μm, He; Program: not specified
CapillaryDB-51476.Viana, Andrade-Neto, et al., 200230. m/0.25 mm/0.25 μm, He; Program: 35C => 4C/min => 180C => 20C/min => 280C
CapillaryHP-51475.Aparicio, Romero, et al., 200130. m/0.25 mm/0.25 μm; Program: not specified
CapillaryDB-51467.Ferreira, Costantin, et al., 2001Program: not specified
CapillaryDB-11474.Figueiredo, Miguel, et al., 200130. m/0.25 mm/0.25 μm; Program: 45 0C 3 K/min -> 175 0C 15 K/min -> 300 0C (10 min)
CapillaryDB-51480.Isidorov, Zenkevich, et al., 2001He; Column length: 30. m; Column diameter: 0.25 mm; Program: not specified
CapillaryCBP-11482.Ly, Yamauchi, et al., 200125. m/0.25 mm/0.25 μm, Nitrogen; Program: not specified
CapillaryDB-51481.Petrakis, Tsitsimpikou, et al., 2001Program: not specified
CapillaryHP-5 MS1482.Shang, Hu, et al., 200130. m/0.25 mm/0.25 μm, Helium; Program: not specified
CapillaryHP-51473.Usubillaga, Aparicio, et al., 200130. m/0.25 mm/0.25 μm, He; Program: 50 0C 3 K/min -> 200 0C 8 K/min -> 280 0C
CapillaryDB-51482.Andrade, Maia, et al., 200030. m/0.25 mm/0.25 μm, He; Program: 40C => 2C/min => 60C => 4C/min => 260C
CapillaryHP-11450.Betts, 200012. m/0.20 mm/0.33 μm, He; Program: 40 0C 6.7 0C/min -> 87 0C (9 min) 10 0C/min -> 187 0C
CapillaryDB-11459.Kéita, Vincent, et al., 200030. m/0.25 mm/0.25 μm, He; Program: not specified
CapillaryDB-11460.Kéita, Vincent, et al., 200030. m/0.25 mm/0.25 μm, He; Program: not specified
CapillaryDB-11474.da Silva, Pedro, et al., 200030. m/0.25 mm/0.25 μm, H2; Program: 40 0C 3 K/min -> 175 0C 15 K/min -> 240 0C (10 min)
CapillaryHP-5MS1490.Bouwmeester, Wallaart, et al., 199930. m/0.25 mm/0.25 μm, He; Program: not specified
CapillaryCP Sil 5 CB1488.Weyerstahl, Marschall, et al., 1999He; Column length: 25. m; Column diameter: 0.39 mm; Program: not specified
CapillaryCP Sil 5 CB1474.Weyerstahl, Marschall, et al., 1999, 2Column length: 25. m; Column diameter: 0.39 mm; Program: not specified
CapillaryDB-11474.Baratta, Dorman, et al., 199830. m/0.25 mm/0.25 μm, He; Program: 45C => 3C/min => 175C => 15C/min => 240C (10min)
CapillaryOV-11476.Kökdil, 199850. m/0.32 mm/0.25 μm, He; Program: 1)50C(1min) => 4C/min => 180C => 2C/min => 250C(10min) 2)50C(1min) => 6C/min => 200C => 12C/min => 250C(5min)
CapillaryDB-51487.Sanda, Koba, et al., 199830. m/0.25 mm/0.25 μm, N2; Program: 45C(5min) => 2C/min => 200C => 5C/min => 250C
CapillaryDB-11474.da Silva, Figueiredo, et al., 199830. m/0.25 mm/0.25 μm, H2; Program: 45C => 3C/min => 175C => 15C => 240C(10min)
CapillaryCP Sil 5 CB1481.Weyerstahl, Marschall, et al., 1998N2; Column length: 25. m; Program: not specified
CapillaryDB-51478.Yusuf, Begum, et al., 199830. m/0.25 mm/0.25 μm, He; Program: 60C => 3C/min => 240C => 30C/min => 300C
CapillaryDB-11474.Figueiredo, Barroso, et al., 199730. m/0.25 mm/0.25 μm, H2; Program: 45C => 3C/min => 175C => 15C/min => 240C(10min)
CapillaryCP Sil 5 CB1479.Weyerstahl, Marschall, et al., 1997He; Column length: 25. m; Program: not specified
CapillaryCP Sil 5 CB1488.Weyerstahl, Marschall, et al., 1997, 2N2; Column length: 25. m; Program: not specified
CapillaryDB-11474.Barroso, Figueiredo, et al., 199630. m/0.25 mm/0.25 μm, H2; Program: 45 0C 3 0C/min -> 175 0C 15 0C/min -> 240 0C (10 min)
CapillaryMethyl Silicone1474.Zenkevich, 1996Program: not specified
CapillaryOV-1011486.Menut, Lamaty, et al., 1994Program: not specified
CapillaryDB-11474.Binder and Flath, 1989Column length: 60. m; Column diameter: 0.32 mm; Program: not specified
CapillaryOV-1011475.De Pooter, Vermeesch, et al., 1989Program: not specified
CapillaryOV-1011475.De Pooter, Vermeesch, et al., 1989Program: not specified
CapillaryOV-11473.De Pooter and Schamp, 198735. m/0.50 mm/1.5 μm; Program: not specified

Normal alkane RI, polar column, temperature ramp

View large format table.

Column type Active phase I Reference Comment
CapillaryRTX-Wax1665.Bendiabdellah, El Amine Dib, et al., 201260. m/0.22 mm/0.25 μm, Helium, 2. K/min, 230. C @ 5. min; Tstart: 60. C
CapillaryHP-Innowax1714.Feng, Cui, et al., 201160. m/0.25 mm/0.25 μm, Helium, 60. C @ 1. min, 5. K/min, 220. C @ 5. min
CapillaryHP-Innowax1726.Menichini, Tundis, et al., 201130. m/0.25 mm/0.25 μm, Helium, 50. C @ 5. min, 5. K/min, 250. C @ 10. min
CapillaryRTX-Wax1710.Dib, Djabou, et al., 201060. m/0.22 mm/0.25 μm, Helium, 2. K/min, 230. C @ 30. min; Tstart: 60. C
CapillaryDB-Wax1710.Karlsson, Birgersson, et al., 200930. m/0.25 mm/0.25 μm, Hydrogen, 30. C @ 5. min, 8. K/min, 230. C @ 10. min
CapillaryRTX-Wax1682.Museli, Pau, et al., 200960. m/0.22 mm/0.25 μm, Helium, 2. K/min, 230. C @ 30. min; Tstart: 60. C
CapillaryDB-Wax1716.Shimizu, Imayoshi, et al., 200960. m/0.25 mm/0.25 μm, Helium, 50. C @ 2. min, 3. K/min, 220. C @ 70. min
CapillaryHP-Innowax1726.Wannes, Mhamdi, et al., 200930. m/0.25 mm/0.52 μm, Nitrogen, 35. C @ 10. min, 3. K/min, 205. C @ 10. min
CapillaryRTX-Wax1701.Paolini, Tomi, et al., 200860. m/0.22 mm/0.25 μm, He, 2. K/min, 230. C @ 35. min; Tstart: 60. C
CapillaryHP Innowax1709.Capetanos, Saroglou, et al., 200730. m/0.32 mm/0.50 μm, Helium, 3. K/min; Tstart: 60. C; Tend: 260. C
CapillaryHP-Innowax1721.Cheraif, Ben Jannet, et al., 200730. m/0.25 mm/0.25 μm, N2, 50. C @ 1. min, 5. K/min, 240. C @ 4. min
CapillaryCarbowax1686.Ferhat, Tigrine-Kordjani, et al., 200760. m/0.2 mm/0.25 μm, He, 60. C @ 8. min, 2. K/min, 250. C @ 15. min
CapillaryHP-Innowax1726.Formisano, Rigano, et al., 200730. m/0.25 mm/0.25 μm, Helium, 40. C @ 5. min, 2. K/min; Tend: 250. C
CapillaryHP-Innowax1703.Hachicha, Skanji, et al., 200730. m/0.25 mm/0.25 μm, He, 2. K/min, 240. C @ 20. min; Tstart: 60. C
CapillaryCP-Wax 52CB1718.Hymete, Rohloff, et al., 200730. m/0.32 mm/0.25 μm, He, 40. C @ 1. min, 3. K/min, 220. C @ 2. min
CapillaryHP-20M1675.Jerkovic, Mastelic, et al., 200750. m/0.2 mm/0.2 μm, He, 70. C @ 4. min, 4. K/min; Tend: 180. C
CapillaryTC-FFAP1708.Kurose, Okamura, et al., 2007He, 3. K/min, 220. C @ 30. min; Column diameter: 0.25 mm; Phase thickness: 0.25 μm; Tstart: 60. C
CapillaryTC-FFAP1704.Kurose, Okamura, et al., 2007He, 3. K/min, 220. C @ 30. min; Column diameter: 0.25 mm; Phase thickness: 0.25 μm; Tstart: 60. C
CapillaryCarbowax 20M1698.Limberger, Scopel, et al., 200730. m/0.25 mm/0.25 μm, He, 3. K/min; Tstart: 60. C; Tend: 230. C
CapillaryCP-Wax 52CB1722.Povolo, Contarini, et al., 200760. m/0.32 mm/0.5 μm, He, 40. C @ 8. min, 4. K/min, 220. C @ 20. min
CapillarySupelcowax-101694.Raal, Orav, et al., 200730. m/0.25 mm/0.25 μm, He, 2. K/min; Tstart: 50. C; Tend: 250. C
CapillarySupelcowax-101708.Sylvestre, Longtin, et al., 200730. m/0.25 mm/0.25 μm, 2. K/min, 210. C @ 33. min; Tstart: 40. C
CapillarySupelcowax-101708.Sylvestre, Pichette, et al., 200730. m/0.25 mm/0.25 μm, 2. K/min, 250. C @ 33. min; Tstart: 40. C
CapillarySupelcowax-101733.Vichi, Riu-Aumatell, et al., 200730. m/0.25 mm/0.25 μm, He, 40. C @ 5. min, 3. K/min, 250. C @ 10. min
CapillaryBP-201704.Boti, Yao, et al., 200650. m/0.22 mm/0.25 μm, 2. K/min, 220. C @ 20. min; Tstart: 60. C
CapillarySupelcowax 101699.Cavaleiro, Pinto, et al., 200630. m/0.20 mm/0.20 μm, Helium, 3. K/min, 220. C @ 15. min; Tstart: 70. C
CapillaryDB-Wax1718.Choi, 200660. m/0.25 mm/0.25 μm, N2, 70. C @ 2. min, 2. K/min, 230. C @ 20. min
CapillaryBP-201704.Fanciullino, Tomi, et al., 200650. m/0.22 mm/0.25 μm, He, 2. K/min, 220. C @ 20. min; Tstart: 60. C
CapillaryHP-20M1667.Filippi, Lanfranchi, et al., 200650. m/0.2 mm/0.1 μm, He, 2. K/min, 220. C @ 30. min; Tstart: 60. C
CapillarySupelcowax-101707.Garneau F.X., Collin G., et al., 200630. m/0.25 mm/0.25 μm, 40. C @ 2. min, 2. K/min, 210. C @ 33. min
CapillaryDB-Wax1710.Lan Phi N.T., Nishiyama C., et al., 200660. m/0.25 mm/0.25 μm, 70. C @ 2. min, 2. K/min, 230. C @ 20. min
CapillarySupelcowax1712.Martin, Joseph, et al., 200630. m/0.32 mm/0.25 μm, N2, 5. K/min; Tstart: 50. C; Tend: 200. C
CapillaryNB-20M1702.Orav, Raal, et al., 200630. m/0.2 mm/0.25 μm, He, 2. K/min; Tstart: 50. C; Tend: 250. C
CapillaryDB-Wax1713.Sawamura, Onishi, et al., 200660. m/0.25 mm/0.25 μm, 70. C @ 2. min, 2. K/min, 230. C @ 20. min
CapillarySupelcowax-101701.Wong, Lim, et al., 200630. m/0.25 mm/0.25 μm, He, 50. C @ 1. min, 4. K/min, 220. C @ 10. min
CapillaryCarbowax 20M1712.Babu and Kaul, 200560. m/0.25 mm/0.25 μm, N2, 40. C @ 2. min, 10. K/min, 190. C @ 15. min
CapillaryDB-Wax1690.Fakhari A.R., Sonboli A., et al., 200530. m/0.25 mm/0.25 μm, N2, 5. K/min, 250. C @ 10. min; Tstart: 60. C
CapillaryHP-Innowax1718.Ferretti, Maggi, et al., 200530. m/0.25 mm/0.17 μm, He, 60. C @ 3. min, 4. K/min, 210. C @ 15. min
CapillarySupelcowax1695.Gauvin and Smadja, 200560. m/0.2 mm/0.2 μm, He, 60. C @ 30. min, 4. K/min; Tend: 230. C
CapillaryStabilwax1684.Jirovetz, Buchbauer, et al., 200530. m/0.32 mm/0.5 μm, H2, 40. C @ 5. min, 6. K/min, 280. C @ 5. min
CapillaryInnowax1729.Joichi, Yomogida, et al., 200560. m/0.25 mm/0.25 μm, He, 5. K/min, 240. C @ 30. min; Tstart: 60. C
CapillaryCP-Wax1683.Ka, Choi, et al., 200530. m/0.32 mm/0.25 μm, He, 40. C @ 2. min, 5. K/min; Tend: 180. C
CapillaryHP-20M1680.Kulisic, Radonic, et al., 200550. m/0.20 mm/0.20 μm, Helium, 70. C @ 4. min, 4. K/min, 180. C @ 10. min
CapillaryHP-20M1680.Kulisic, Radonic, et al., 200550. m/0.20 mm/0.20 μm, Helium, 70. C @ 4. min, 4. K/min, 180. C @ 10. min
CapillaryDB-Wax1727.Njoroge, Koaze, et al., 200560. m/0.25 mm/0.25 μm, N2, 70. C @ 2. min, 2. K/min, 230. C @ 20. min
CapillaryPE-Wax1721.Ram, Kumar, et al., 200550. m/0.32 mm/0.25 μm, H2, 4. K/min, 220. C @ 2. min; Tstart: 60. C
CapillaryDB-Wax1720.Salehi, Sonboli, et al., 200530. m/0.25 mm/0.25 μm, He, 4. K/min, 250. C @ 10. min; Tstart: 40. C
CapillarySupelcowax-101683.Stevanovic, Garneau, et al., 200530. m/0.25 mm/0.25 μm, 40. C @ 2. min, 2. K/min, 210. C @ 33. min
CapillaryCarbowax1715.Szafranek, Chrapkowska, et al., 200530. m/0.25 mm/0.25 μm, 4. K/min; Tstart: 40. C; Tend: 200. C
CapillarySupelcowax-101733.Vichi, Riu-Aumatell, et al., 200530. m/0.25 mm/0.25 μm, 40. C @ 5. min, 3. K/min, 220. C @ 10. min
CapillarySupelcowax-101697.Wong, Lee, et al., 200530. m/0.25 mm/0.25 μm, He, 50. C @ 3. min, 4. K/min, 220. C @ 30. min
CapillaryZB-Wax1675.N/A30. m/0.32 mm/0.25 μm, Helium, 40. C @ 2. min, 5. K/min, 250. C @ 5. min
CapillaryZB-Wax1683.N/A30. m/0.32 mm/0.25 μm, Helium, 40. C @ 2. min, 5. K/min, 250. C @ 5. min
CapillaryZB-Wax1683.N/A30. m/0.32 mm/0.25 μm, Helium, 40. C @ 2. min, 5. K/min, 250. C @ 5. min
CapillaryDB-Wax1721.Choi, 200460. m/0.25 mm/0.25 μm, N2, 70. C @ 2. min, 2. K/min, 230. C @ 20. min
CapillarySupelcowax-101707.González, Guerra, et al., 200430. m/0.25 mm/0.25 μm, N2, 2. K/min; Tstart: 40. C; Tend: 230. C
CapillaryDB-Wax1703.Jiang and Kubota, 2004He, 60. C @ 4. min, 2. K/min; Column length: 60. m; Column diameter: 0.25 mm; Tend: 220. C
CapillaryDB-Wax1703.Jiang and Kubota, 2004He, 60. C @ 4. min, 2. K/min; Column length: 60. m; Column diameter: 0.25 mm; Tend: 220. C
CapillaryCarbowax 20M1664.Lago, de Ávila, et al., 200430. m/0.25 mm/0.25 μm, He, 3. K/min; Tstart: 60. C; Tend: 250. C
CapillarySupelcowax-101666.Lopez Arze, Collin, et al., 200430. m/0.25 mm/0.25 μm, 40. C @ 2. min, 2. K/min, 210. C @ 33. min
CapillaryBP-201704.Mallavarapu, Kulkarni, et al., 200425. m/0.25 mm/0.25 μm, N2, 5. K/min; Tstart: 60. C; Tend: 220. C
CapillarySupelcowax-101690.Orav, Stulova, et al., 200450. m/0.2 mm/0.25 μm, He, 2. K/min; Tstart: 70. C; Tend: 230. C
CapillarySupelcowax-101690.Orav, Stulova, et al., 200450. m/0.2 mm/0.25 μm, He, 2. K/min; Tstart: 70. C; Tend: 230. C
CapillaryDB-Wax1710.Palá-Paúl, Brophy, et al., 200460. m/0.32 mm/0.25 μm, He, 3. K/min; Tstart: 35. C; Tend: 220. C
CapillarySW-101673.Raal, Paaver, et al., 200450. m/0.20 mm/0.25 μm, He, 2. K/min; Tstart: 50. C; Tend: 230. C
CapillaryHP-Wax1715.Bertoli, Menichini, et al., 200330. m/0.25 mm/0.25 μm, N2, 60. C @ 10. min, 5. K/min; Tend: 220. C
CapillaryDB-Wax1719.Mookdasanit, Tamura, et al., 2003Helium, 2. K/min, 210. C @ 60. min; Column length: 60. m; Column diameter: 0.25 mm; Tstart: 70. C
CapillarySupelcowax-101690.Orav, Kailas, et al., 200350. m/0.2 mm/0.25 μm, He, 2. K/min; Tstart: 70. C; Tend: 230. C
CapillaryCarbowax 20M1727.Priestap, van Baren, et al., 200350. m/0.25 mm/0.25 μm, N2, 3. K/min; Tstart: 90. C; Tend: 220. C
CapillarySW-101690.Raal, Arak, et al., 200350. m/0.20 mm/0.25 μm, He, 2. K/min; Tstart: 50. C; Tend: 250. C
CapillaryHP-Innowax1720.Stashenko, Jaramillo, et al., 200350. m/0.2 mm/0.2 μm, 50. C @ 5. min, 4. K/min; Tend: 220. C
CapillaryHP-Innowax1720.Stashenko, Jaramillo, et al., 200350. m/0.2 mm/0.2 μm, 50. C @ 5. min, 4. K/min; Tend: 220. C
CapillaryInnowax1726.Suleimenov, Atazharova, et al., 2003He, 60. C @ 10. min, 4. K/min, 220. C @ 10. min; Column length: 60. m; Column diameter: 0.25 mm
CapillaryDB-Wax1693.Tu, Onishi, et al., 200360. m/0.25 mm/0.25 μm, N2, 70. C @ 2. min, 2. K/min, 230. C @ 20. min
CapillaryDB-Wax1696.Tu, Onishi, et al., 2003, 260. m/0.25 mm/0.25 μm, N2, 70. C @ 2. min, 2. K/min, 230. C @ 20. min
CapillaryDB-Wax1689.Gancel, Ollé, et al., 200260. m/0.32 mm/0.25 μm, H2, 1.5 K/min, 245. C @ 20. min; Tstart: 40. C
CapillarySupelcowax-101682.Kabouss, Charrouf, et al., 200230. m/0.25 mm/0.25 μm, 40. C @ 2. min, 2. K/min, 210. C @ 33. min
CapillaryCarbowax 20M1712.Kasali, Winterhalter, et al., 200230. m/0.25 mm/0.325 μm, He, 4. K/min, 215. C @ 20. min; Tstart: 50. C
CapillarySupelcowax-101690.Orav, Kailas, et al., 200260. m/0.2 mm/0.5 μm, He, 2. K/min; Tstart: 70. C; Tend: 220. C
CapillaryHP-Wax1724.Priestap, van Baren, et al., 200250. m/0.25 mm/0.25 μm, N2, 75. C @ 4. min, 3. K/min; Tend: 220. C
CapillaryDB-Wax1702.Tu, Onishi, et al., 200260. m/0.25 mm/0.25 μm, N2, 70. C @ 2. min, 2. K/min, 230. C @ 20. min
CapillaryDB-Wax1719.Tu, Thanh, et al., 200260. m/0.25 mm/0.25 μm, N2, 2. K/min; Tstart: 70. C; Tend: 230. C
CapillaryDB-Wax1709.Christoph, 200160. m/0.25 mm/0.25 μm, He, 3. K/min; Tstart: 45. C; Tend: 240. C
CapillaryTC-Wax1693.Miyazawa, Kurose, et al., 2001He, 4. K/min, 250. C @ 47. min; Column length: 60. m; Column diameter: 0.25 mm; Tstart: 80. C
CapillaryPEG-20M1700.Orav, Kailas, et al., 2001He, 2. K/min; Column length: 50. m; Column diameter: 0.2 mm; Tstart: 70. C; Tend: 250. C
CapillaryPEG-20M1700.Orav and Kann, 2001He, 2. K/min; Column length: 50. m; Column diameter: 0.2 mm; Tstart: 70. C; Tend: 220. C
CapillaryInnowax1726.Baser, Özek, et al., 200060. m/0.25 mm/0.25 μm, He, 60. C @ 10. min, 4. K/min, 220. C @ 10. min
CapillaryInnowax1726.Baser, Özek, et al., 200060. m/0.25 mm/0.25 μm, He, 60. C @ 10. min, 4. K/min, 220. C @ 10. min
CapillaryDB-Wax1707.Buttery, Light, et al., 200060. m/0.25 mm/0.25 μm, 30. C @ 4. min, 2. K/min, 170. C @ 30. min
CapillaryCP-Wax 52CB1708.Chagonda, Makanda, et al., 2000, 250. m/0.30 mm/0.25 μm, He, 40. C @ 5. min, 3. K/min; Tend: 220. C
CapillaryDB-Wax1683.Franco and Shibamoto, 2000He, 50. C @ 8. min, 3. K/min; Column length: 30. m; Column diameter: 0.2 mm; Tend: 180. C
CapillaryDB-Wax1720.Tamura, Boonbumrung, et al., 2000Nitrogen, 40. C @ 10. min, 2. K/min; Column length: 60. m; Column diameter: 0.25 mm; Tend: 200. C
CapillaryDB-Wax1705.Umano, Hagi, et al., 200060. m/0.25 mm/0.25 μm, He, 40. C @ 2. min, 2. K/min; Tend: 200. C
CapillaryFFAP1746.Ajaiyeoba and Ekundayo, 1999N2, 70. C @ 5. min, 3. K/min; Column length: 25. m; Column diameter: 0.25 mm; Tend: 210. C
CapillaryCW 20M1673.Bicchi, Binello, et al., 199925. m/0.32 mm/0.25 μm, Hydrogen, 50. C @ 1. min, 3. K/min, 220. C @ 10. min
CapillaryCW 20M1675.Bicchi, Binello, et al., 199925. m/0.32 mm/0.25 μm, Hydrogen, 50. C @ 1. min, 3. K/min, 220. C @ 10. min
CapillaryCW 20M1675.Bicchi, Binello, et al., 199925. m/0.32 mm/0.25 μm, Hydrogen, 50. C @ 1. min, 3. K/min, 220. C @ 10. min
CapillaryCW 20M1676.Bicchi, Binello, et al., 199925. m/0.32 mm/0.25 μm, Hydrogen, 50. C @ 1. min, 3. K/min, 220. C @ 10. min
CapillaryCW 20M1676.Bicchi, Binello, et al., 199925. m/0.32 mm/0.25 μm, Hydrogen, 50. C @ 1. min, 3. K/min, 220. C @ 10. min
CapillaryCW 20M1677.Bicchi, Binello, et al., 199925. m/0.32 mm/0.25 μm, Hydrogen, 50. C @ 1. min, 3. K/min, 220. C @ 10. min
CapillaryHP Innowax FSP1726.Kaya, Baser, et al., 199960. m/0.25 mm/0.25 μm, He, 60. C @ 10. min, 220. C @ 10. min
CapillaryInnowax1726.Kaya, Baser, et al., 1999, 260. m/0.25 mm/0.25 μm, He, 60. C @ 10. min; Tend: 220. C
CapillaryHP-Innowax1726.Kaya, Baser, et al., 1999, 360. m/0.25 mm/0.25 μm, He, 60. C @ 10. min; Tend: 220. C
CapillaryHP-Innowax1726.Kaya, Baser, et al., 1999, 360. m/0.25 mm/0.25 μm, He, 60. C @ 10. min; Tend: 220. C
CapillaryHP-Innowax1726.Kaya, Baser, et al., 1999, 360. m/0.25 mm/0.25 μm, He, 60. C @ 10. min; Tend: 220. C
CapillaryCarbowax1714.Menon, Chacko, et al., 1999N2, 1. K/min, 200. C @ 20. min; Column length: 50. m; Column diameter: 0.2 mm; Tstart: 80. C
CapillaryDB-Wax1721.Ngassoum, Yonkeu, et al., 199960. m/0.25 mm/0.25 μm, He, 4. K/min; Tstart: 60. C; Tend: 240. C
CapillaryNB-3511702.Onocha, Ekundayo, et al., 199925. m/0.3 mm/0.5 μm, H2, 70. C @ 2. min, 5. K/min; Tend: 250. C
CapillaryDB-Wax1746.Molleken U., Sinnwell V., et al., 199830. m/0.25 mm/0.25 μm, N2, 3. K/min; Tstart: 45. C; Tend: 220. C
CapillaryDB-Wax1722.Mölleken, Sinnwell, et al., 199830. m/0.25 mm/0.25 μm, N2, 3. K/min; Tstart: 45. C; Tend: 220. C
CapillaryHP-Innowax1721.Stashenko, Cervantes, et al., 199860. m/0.25 mm/0.25 μm, He, 50. C @ 5. min, 5. K/min; Tend: 220. C
CapillaryHP-Innowax FSC1726.Tümen, Baser, et al., 199860. m/0.25 mm/0.25 μm, He, 60. C @ 10. min, 4. K/min, 220. C @ 10. min
CapillarySupelcowax-101707.Zunino, Novillo-Newton, et al., 19974. K/min; Column length: 30. m; Column diameter: 0.25 mm; Tstart: 60. C; Tend: 240. C
CapillaryDB-Wax1703.Pollak and Berger, 199630. m/0.32 mm/0.5 μm, He, 40. C @ 1. min, 3. K/min, 210. C @ 25. min
CapillaryDB-Wax1721.Stashenko, Puertas, et al., 199660. m/0.25 mm/0.25 μm, He, 50. C @ 5. min, 2.5 K/min; Tend: 180. C
CapillaryDB-Wax1687.Stashenko, Torres, et al., 199560. m/0.25 mm/0.25 μm, He, 50. C @ 5. min, 2.5 K/min; Tend: 180. C
CapillaryCarbowax 20M1714.Tirado, Stashenko, et al., 199560. m/0.25 mm/0.25 μm, He, 50. C @ 10. min, 2. K/min, 150. C @ 20. min
CapillarySupelcowax-101705.Collin, Deslauriers, et al., 199340. C @ 2. min, 2. K/min, 210. C @ 120. min
CapillarySupelcowax-101706.Collin, Deslauriers, et al., 199340. C @ 2. min, 2. K/min, 210. C @ 120. min
CapillaryCarbowax 20M1685.Kollmannsberger, Nitz, et al., 199245. m/0.32 mm/1.0 μm, Hydrogen, 60. C @ 5. min, 2. K/min; Tend: 200. C
CapillaryDB-Wax1704.Binder, Benson, et al., 19904. K/min, 230. C @ 10. min; Column length: 60. m; Column diameter: 0.32 mm; Tstart: 50. C
CapillaryDB-Wax1704.Binder, Turner, et al., 19904. K/min, 230. C @ 10. min; Column length: 60. m; Column diameter: 0.32 mm; Tstart: 50. C
CapillaryDB-Wax1704.Binder, Turner, et al., 1990, 24. K/min, 230. C @ 10. min; Column length: 60. m; Column diameter: 0.32 mm; Tstart: 50. C
CapillaryDB-Wax1705.Binder and Flath, 198950. C @ 0.1 min, 4. K/min, 250. C @ 5. min; Column length: 60. m; Column diameter: 0.32 mm
CapillaryCarbowax 20M1692.Gaydou, Faure, et al., 198950. m/0.32 mm/0.15 μm, H2, 2. K/min; Tstart: 70. C; Tend: 210. C
CapillarySupelcowax-101712.Ramaswami, Briscese, et al., 198850. C @ 2. min, 4. K/min, 240. C @ 10. min; Column length: 30. m
CapillaryCarbowax 20M1680.Buttery, Maddox, et al., 1986He, 60. C @ 40. min, 1. K/min; Column length: 150. m; Column diameter: 0.66 mm; Tend: 170. C
CapillaryCarbowax 20M1699.Nykanen, 198640. C @ 5. min, 2. K/min; Column length: 25. m; Column diameter: 0.30 mm; Tend: 220. C
CapillarySupelcowax-101712.Ramaswami, Briscese, et al., 1986He, 50. C @ 2. min, 4. K/min, 240. C @ 10. min; Column length: 30. m

Normal alkane RI, polar column, custom temperature program

View large format table.

Column type Active phase I Reference Comment
CapillaryInnowax FSC1726.Akin, Saracoglu, et al., 201260. m/0.25 mm/0.25 μm, Helium; Program: 60 0C (10 min) 4 0C/min -> 220 0C (10 min) 1 oC/min -> 240 0C
CapillaryInnowax FSC1726.Demirci, Temel, et al., 201160. m/0.25 mm/0.25 μm, Helium; Program: 60 0C (10 min) 4 0C/min -> 220 0C (10 min) 1 0C/min -> 240 0C
CapillaryHP-Innowax1721.Feng, Cui, et al., 201160. m/0.25 mm/0.25 μm, Helium; Program: not specified
CapillaryHP Innowax1719.Laribi, Kouki, et al., 201130. m/0.25 mm/0.25 μm, Nitrogen; Program: 35 0C (10 min) 3 0C/min -> 205 0C 10 0C/min -> 225 0C
CapillaryInnowax1726.Noorizadeh, Farmany, et al., 201160. m/0.25 mm/0.33 μm; Program: not specified
CapillaryHP Innowax1726.Noorizadeh and Farmany, 201060. m/0.25 mm/0.33 μm; Program: not specified
CapillaryHP Innowax1726.Mancini, Arnold, et al., 200950. m/0.20 mm/0.25 μm, Helium; Program: 40 0C (5 min) 2 0C/min -> 270 0C -> 260 0C (20 min)
CapillaryHP Innowax FSP1726.Wedge, Klun, et al., 200960. m/0.25 mm/0.25 μm, Helium; Program: 60 0C (10 min) 4 0C/min -> 220 0C (10 min) 1 0C/min -> 240 0C (20 min)
CapillaryInnowax1707.Aicha, Ines, et al., 200830. m/0.25 mm/0.25 μm, Helium; Program: not specified
CapillaryHP-Innowax FSC1726.Baser K.H.C. and Demirci B., 200760. m/0.25 mm/0.25 μm, N2; Program: 60C(10min) => 4C/min => 220C(10min) => 1C/min => 240C
CapillaryHP-Innowax1726.Formisano, Mignola, et al., 200750. m/0.2 mm/0.2 μm, He; Program: 40C(5min) => 2C/min => 250C(15min) => 10C/min => 270C
CapillaryCarbowax 20M1709.Hudaib and Aburjai, 200730. m/0.25 mm/0.25 μm, He; Program: not specified
CapillaryInnowax FSC1726.Kaya, Benirci, et al., 200760. m/0.25 mm/0.25 μm, Nitrogen; Program: 60 0C (10 min) 1 0C/min -> 220 0C (10 min) 1 0C/min -> 240 0C
CapillaryAquaWax1689.Liolios, Laouer, et al., 2007Program: not specified
CapillaryBP-201683.Pontes, Marques, et al., 200730. m/0.25 mm/0.25 μm, He; Program: 50C(1min) => 2.5C/min => 100C => 2C/min => 180C => 15C/min => 220C
CapillaryBP-201683.Pontes, Marques, et al., 200730. m/0.25 mm/0.25 μm, He; Program: 50C(1min) => 2.5C/min => 100C => 2C/min => 180C => 15C/min => 220C
CapillaryHP-Innowax FSC1726.Tabanca N., Demirci B., et al., 200760. m/0.25 mm/0.25 μm, He; Program: 60C(10min) => 4C/min => 220C(10min) => 1C/min => 240C
CapillaryInnowax FSC1726.Tabanca, Demirci, et al., 200760. m/0.25 mm/0.25 μm, He; Program: 60C(10min) => 4C/min => 220C (10min) => 1C/min => 240C
CapillaryHP Innowax FSP1726.Tabanca N., Demirci B., et al., 2007, 260. m/0.25 mm/0.25 μm, N2; Program: 60C(10min) => 4C/min => 220C(10min) => 1C/min => 240C
CapillaryDB-Wax1687.Wenguang, Wenlai, et al., 200730. m/0.25 mm/0.25 μm; Program: 40 0C (3 min) 3 0C/min -> 150 0C (2 min) 6 0C/min -> 230 0C (10 min)
CapillaryInnowax FSC1726.Baser K.H.C., Ozek G., et al., 200660. m/0.25 mm/0.25 μm, He; Program: 60C(10min) => 4C/min => 220C (10min) => 1C/min => 240C
CapillaryInnowax FSC1726.Baser, Özek, et al., 200660. m/0.25 mm/0.25 μm, He; Program: 60C(10min) => 4C/min >220C (10min) => 1C/min => 240C
CapillaryInnowax FSC1726.Baser, Özek, et al., 200660. m/0.25 mm/0.25 μm, He; Program: 60C(10min) => 4C/min >220C (10min) => 1C/min => 240C
CapillaryHP-Innowax FSC1726.Erdurak, Coskun, et al., 200660. m/0.25 mm/0.25 μm, He; Program: 60C(10min) => 4C/min => 220C (10min) => 1C/min => 240C
CapillaryHP-Innowax1726.Senatore, Apostolides Arnold, et al., 200650. m/0.2 mm/0.2 μm, He; Program: 40C(5min) => 2C/min => 250C (15min) => 10C/min => 270C
CapillaryHP-Innowax FSC1726.Suleimenov Y.M., Atazhanova G.A., et al., 200660. m/0.25 mm/0.25 μm, He; Program: 60(10min) => 4C/min => 220C(10min) => 1C/min => 240C
CapillaryHP-Innowax FSC1722.Tabanca, Demirci, et al., 200660. m/0.25 mm/0.25 μm; Program: 60C(10min) => 4C/min => 220C (10min) => 1C/min => 240C
CapillaryHP-Innowax FSC1726.Tabanca, Demirci, et al., 2006, 260. m/0.25 mm/0.25 μm, N2; Program: 60C(10min) => 4C/min => 220C => (10min) => 1C/min => 240C
CapillaryInnowax FSC1726.Tosun, Kürkcüoglu, et al., 200660. m/0.25 mm/0.25 μm, He; Program: 60C(10min) => 4C/min => 220C (10min) => 1C/min => 240C
CapillaryHP-Innowax FSC1726.Tunalier, Candan, et al., 200660. m/0.25 mm/0.25 μm, N2; Program: 60C(10min) => 4C/min => 220C(10min) => 1C/min => 240C
CapillaryHP-Innowax1726.Demirci, Demirci, et al., 200560. m/0.25 mm/0.25 μm, N2; Program: 60C(10min) => 4C/min => 220C (10min) => 1C/min => 240C
CapillaryHP-Innowax FSC1726.Demirci, Demirci, et al., 2005, 260. m/0.25 mm/0.25 μm, N2; Program: 60C(10min) => 4C/min => 220C (10min) => 1C/min => 240C
CapillaryHP-Innowax1726.Duman, Kartal, et al., 200560. m/0.25 mm/0.25 μm, N2; Program: 60C(10min) => 4C/min => 220C(10min) => 1C/min => 240C
CapillaryDB-Wax1713.Pala-Paul, Perez-Alonso, et al., 2005N2; Program: not specified
CapillaryHP-Innowax FSC1726.Sezik E., Kocakulak E., et al., 200560. m/0.25 mm/0.25 μm, He; Program: 60C(10min) => 4C/min => 220C(10min) => 1C/min => 240C
CapillaryHP-Innowax FSC1722.Tabanca, Demirci, et al., 200560. m/0.25 mm/0.25 μm, He; Program: 60C(10min) => 4C/min => 220C(10min) => 1C/min => 240C
CapillaryHP-Innowax FSC1726.Viljoen, Subramoney, et al., 200560. m/0.25 mm/0.25 μm, He; Program: 60C(10min) => 4C/min => 220C(10min) => 1C/min => 240C
CapillaryHP Innowax FSP1726.Altintas, Kose, et al., 200460. m/0.25 mm/0.25 μm, N2; Program: 60C(10min) => 4C/min => 220C(10min) => 1C/min => 240C
CapillaryHP-Innowax FSC1726.Demirci, Paper, et al., 200460. m/0.25 mm/0.25 μm, He; Program: 60C(10min) => 4C/min => 220C(10min) => 1C/min => 240C
CapillaryHP-Innowax FSC1726.Demirci, Paper, et al., 2004, 260. m/0.25 mm/0.25 μm, N2; Program: 60C(10min) => 4C/min => 220C(10min) => 1C/min => 240C
CapillaryHP-Innowax FSC1726.Kivcak, Akay, et al., 200460. m/0.25 mm/0.25 μm, He; Program: 60C(10min) => 4C/min => 220C(10min) => 1C/min => 240C
CapillaryHP-Innowax FSC1726.Kivcak, Akay, et al., 200460. m/0.25 mm/0.25 μm, He; Program: 60C(10min) => 4C/min => 220C(10min) => 1C/min => 240C
CapillaryHP-Innowax1726.Senatore, Apostolides Arnold, et al., 200450. m/0.2 mm/0.2 μm; Program: not specified
CapillaryCarbowax 20M1680.Vinogradov, 2004Program: not specified
CapillaryCarbowax 20M1703.Vinogradov, 2004Program: not specified
CapillaryHP Innowax FSP1726.Baser, Demirci, et al., 200360. m/0.25 mm/0.25 μm, He; Program: 60C(10min) => 4C/min => 220C(10min) => 1C/min => 240C
CapillaryInnowax FSC1726.Baser, Demirci, et al., 2003, 260. m/0.25 mm/0.25 μm, He; Program: 60C(10min) => 4C/min => 220C (10min) => 1C/min => 240C
CapillaryHP-Innowax FSC1726.Demirci, Baser, et al., 200360. m/0.25 mm/0.25 μm, He; Program: 60C (10min) => 4C/min => 220C (10min) => 1C/min => 240C
CapillaryHP-Innowax FSC1726.Demirci, Dadandi, et al., 200360. m/0.25 mm/0.25 μm, He; Program: 60C(10min) => 4C/min => 220C(10min) => 1C/min => 240C
CapillaryHP-Innowax FSC1726.Demirci, Demirci, et al., 200360. m/0.25 mm/0.25 μm, He; Program: 60C(10min) => 4C/min => 220C(10min) => 1C/min => 240C
CapillaryHP-Innowax FSC1726.Kaya, Demirci, et al., 200360. m/0.25 mm/0.25 μm, N2; Program: 60C(10min) => 4C/min => 220C(10min) => 1C/min => 240C
CapillaryHP-Innowax1726.Baser, Demirci, et al., 200260. m/0.25 mm/0.25 μm, He; Program: 60 0C (10 min) 4 K/min -> 220 0C (10 min) 1 K/min -> 240 0C
CapillaryInnowax FSC1726.Baser, Demirei, et al., 200260. m/0.25 mm/0.25 μm, He; Program: 60C(10min) => 4C/min => 220C(10min) => 1C/min => 240C
CapillaryHP-Innowax1726.Demirci, Baser, et al., 200260. m/0.25 mm/0.25 μm, He; Program: 60 0C (10 min) 4 K/min -> 220 0C (10 min) 1 K/min -> 240 0C
CapillaryHP-Innowax FSC1726.Hüsnü Can Baser, Demirci, et al., 200260. m/0.25 mm/0.25 μm, N2; Program: 60C(10min) => 4C/min => 220C(10min) => 1C/min => 240C
CapillaryInnowax FSC1726.Tunalier, Kirimer, et al., 200260. m/0.25 mm/0.25 μm; Program: 60C(10min) => 4C/min => 220C(10min) => 1C/min => 240C
CapillaryHP-Innowax1726.Baser, Demirci, et al., 200160. m/0.25 mm/0.25 μm, He; Program: 60 0C (10 min) 10 K/min -> 220 0C (10 min) 1K/min -> 240 0C
CapillaryHP-Innowax1726.Gören, Demirci, et al., 200160. m/0.25 mm/0.25 μm, He; Program: 60 0C (10 min) 4 K/min -> 220 0C (10 min) 1 K/min -> 240 0C
CapillaryHP-Innowax FSC1726.Kaya, Demirci, et al., 200160. m/0.25 mm/0.25 μm; Program: 60C(10min) => 4C/min => 220C(10min) => 1C/min => 240C
CapillaryInnowax1726.Özcan, Akgül, et al., 200160. m/0.25 mm/0.25 μm, He; Program: 60C(10min) => 4C/min => 200C(10min) => 1C/min => 240C
CapillaryInnowax FSC1726.Saglam, Gozler, et al., 200160. m/0.25 mm/0.25 μm, He; Program: 60C(10min) => 4C/min => 220C(10min) => 1C/min => 240C
CapillaryInnowax FSC1726.Tabanca N., Demirci F., et al., 200160. m/0.25 mm/0.25 μm, He; Program: 60C(10min) => 4C/min => 220C(10min) => 1C/min => 240C
CapillaryHP-Innowax FSC1726.Tabanca, Kirimer, et al., 200160. m/0.25 mm/0.25 μm; Program: 60C(10min) => 4C/min => 220C(10min) => 1C/min => 240C
CapillaryHP-Innowax1726.Tabanca, Kirimer, et al., 2001, 260. m/0.25 mm/0.25 μm, He; Program: 60C(10min) => 4C/min => 220C(10min) => 1C/min => 240C
CapillaryFFAP1705.Tucker, Maciarello, et al., 200150. m/0.2 mm/0.33 μm; Program: 60C(1min) => 2.5C/min => 115C => 1C/min => 210C(30min)
CapillaryHP-Wax1719.Usubillaga, Aparicio, et al., 200160. m/0.25 mm/0.25 μm, He; Program: 50 0C 3 K/min -> 200 0C 8 K/min -> 280 0C
CapillaryInnowax1726.Ahmed, Choudhary, et al., 2000He; Column length: 60. m; Column diameter: 0.25 mm; Program: 60 0C (10 min) 4 K/min -> 220 0C (10 min) 1 K/min -> 240 0C
CapillaryInnowax1726.Baser, Özek, et al., 2000, 260. m/0.25 mm/0.25 μm, He; Program: 60 0C (10 min) 4 K/min -> 220 0C (10 min) 1 K/min -> 240 0C
CapillaryInnowax1726.Baser, Tabanca, et al., 200060. m/0.25 mm/0.25 μm, He; Program: 60 0C (10 min) 4 K/min -> 220 0C (10 min) 1 K/min -> 240 0C
CapillaryRTX-Wax1669.Kéita, Vincent, et al., 200030. m/0.25 mm/0.25 μm, He; Program: not specified
CapillaryRTX-Wax1670.Kéita, Vincent, et al., 200030. m/0.25 mm/0.25 μm, He; Program: not specified
CapillaryInnowax FSC1726.Kirimer, Tabanca, et al., 200060. m/0.25 mm/0.25 μm, He; Program: 60C(10 min) => 4C/min => 220C(10min) => 1C/min => 240C
CapillarySupelcowax-101706.Zunino, Lopez, et al., 2000Program: not specified
CapillaryInnowax FSC1726.Kirimer, Tabanca, et al., 199960. m/0.25 mm/0.25 μm, Helium; Program: 60 0C (10 min) 4 0C/min -> 220 0C (10 min) 1 0C/min -> 240 0C
CapillaryNB-3511696.Kerrola, Galambosi, et al., 199425. m/0.32 mm/0.2 μm; Program: 40C(5min) => 4C/min => 170C => 8C/min => 240C (12min)
CapillaryNB-3511691.Kerrola and Kallio, 199425. m/0.32 mm/0.2 μm, He; Program: 35C(5min) => 2.5C/min => 150C => 5C/min => 240C (20min)
CapillaryCP-Wax 52CB1700.Vernin, 1991Column length: 50. m; Column diameter: 0.32 mm; Program: not specified
CapillaryPolyethylene Glycol1713.Vernin, Metzger, et al., 1990Program: not specified
CapillaryDB-Wax1708.Binder and Flath, 1989Column length: 60. m; Column diameter: 0.32 mm; Program: not specified
CapillaryCarbowax 20M1735.Hamilton-Kemp, Rodrigues, et al., 1989Program: not specified

References

Boti, Koukoua, et al., 2007
Boti, J.B.; Koukoua, G.; N'Guessan, T.Y.; Casanova, J., Chemical variability of Conyza sumatrensis and Microglossa pyrifolia from Côte d'Ivoire, Flavour Fragr. J., 2007, 22, 1, 27-31, https://doi.org/10.1002/ffj.1743 . [all data]

Kundakovic, Fokialakis, et al., 2007
Kundakovic, T.; Fokialakis, N.; Kovacevic, N.; Chinou, I., Essential oil composition of Achillea lingulata and A. umbellata, Flavour Fragr. J., 2007, 22, 3, 184-187, https://doi.org/10.1002/ffj.1778 . [all data]

Lesueur, de Rocca Serra, et al., 2007
Lesueur, D.; de Rocca Serra, D.; Bighelli, A.; Hoi, T.M.; Ban, N.K.; Thai, T.H.; Casanova, J., Chemical composition and antibacterial activity of the essential oil of Michelia foveolata Merryll ex Dandy from Vietnam, Flavour Fragr. J., 2007, 22, 4, 317-321, https://doi.org/10.1002/ffj.1799 . [all data]

Maksimovic, Vidic, et al., 2007
Maksimovic, M.; Vidic, D.; Milos, M.; Solic, M.E.; Abadzic, S.; Siljak-Yakovlev, S., Effect of the environmental conditions on essential oil profile in two Dinaric Salvia species: S. brachyodon Vandas and S. officinalis L., Biochem. Syst. Ecol., 2007, 35, 8, 473-478, https://doi.org/10.1016/j.bse.2007.02.005 . [all data]

Maric, Jukic, et al., 2007
Maric, S.; Jukic, M.; Katalinic, V.; Milos, M., Comparison of chemical composition and free radical scavenging ability of glycosidically bound and free volatiles from Bosnian pine (Pinus heldreichii Christ. var. leucodermis), Molecules, 2007, 12, 3, 283-289, https://doi.org/10.3390/12030283 . [all data]

Muselli, Rossi, et al., 2007
Muselli, A.; Rossi, P.-G.; Desjobert, J.-M.; Bernardini, A.-F.; Berti, L.; Costa, J., Chemical composition and antibacterial activity of Otanthus maritimus (L.) Hoffmanns. Link essential oils from Corsica, Flavour Fragr. J., 2007, 22, 3, 217-223, https://doi.org/10.1002/ffj.1787 . [all data]

Paolini J., Costa J., et al., 2007
Paolini J.; Costa J.; Bernardini A.F., Analysis of the essential oil from the roots of Eupatorium cannabinum subsp corsicum (L.) by GC, GC-MS and C-13-NMR, Phytochem. Anal., 2007, 18, 3, 235-244, https://doi.org/10.1002/pca.977 . [all data]

Paolini, Muselli, et al., 2007
Paolini, J.; Muselli, A.; Bernardini, A.-F.; Bighelli, A.; Casanova, J.; Costa, J., Thymol derivatives from essential oil of Doronicum corsicum L., Flavour Fragr. J., 2007, 22, 6, 479-487, https://doi.org/10.1002/ffj.1824 . [all data]

Politeo, Jukic, et al., 2007
Politeo, O.; Jukic, M.; Milos, M., Chemical composition and antioxidant capacity of free volatile aglycones from basil (Ocimum basilicum L.) compared with its essential oil, Food Chem., 2007, 101, 1, 379-385, https://doi.org/10.1016/j.foodchem.2006.01.045 . [all data]

Saroglou, Marin, et al., 2007
Saroglou, V.; Marin, P.D.; Rancic, A.; Veljic, M.; Skaltsa, H., Composition and antimicrobial activity of the essential oil of six Hypericum species from Serbia, Biochem. Syst. Ecol., 2007, 35, 3, 146-152, https://doi.org/10.1016/j.bse.2006.09.009 . [all data]

Boti, Bighelli, et al., 2006
Boti, J.B.; Bighelli, A.; Cavaleiro, C.; Salgueiro, L.; Casanova, J., Chemical variability of Juniperus oxycedrus ssp. oxycedrus berry and leaf oils from Corsica, analysed by combination of GC, GC-MS and 13C-NMR, Flavour Fragr. J., 2006, 21, 2, 268-273, https://doi.org/10.1002/ffj.1579 . [all data]

Dob, Dahmane, et al., 2006
Dob, T.; Dahmane, D.; Agli, M.; Chelghoum, C., Essential oil composition of Lavandula stoechas from Algeria, Pharm. Biol., 2006, 44, 1, 60-64, https://doi.org/10.1080/13880200500496421 . [all data]

Flamini, Tebano, et al., 2006
Flamini, G.; Tebano, M.; Cioni, P.L.; Bagci, Y.; Dural, H.; Ertugrul, K.; Uysal, T.; Savran, A., A multivariate statistical approach to Centaurea classification using essential oil composition data of some species from Turkey, Pl. Syst. Evol., 2006, 261, 1-4, 217-228, https://doi.org/10.1007/s00606-006-0448-3 . [all data]

Gonny, Cavaleiro, et al., 2006
Gonny, M.; Cavaleiro, C.; Salgueiro, L.; Casanova, J., Analysis of Juniperus communis subsp. alpina needle, berry, wood and root oils by combination of GC, GC/MS and 13C-NMR, Flavour Fragr. J., 2006, 21, 1, 99-106, https://doi.org/10.1002/ffj.1527 . [all data]

Pinto, Pina-Vaz, et al., 2006
Pinto, E.; Pina-Vaz, C.; Salgueiro, L.; Goncalves, M.J.; Costa-de-Oliveira, S.; Cavaleiro, C.; Palmeira, A.; Rodrigues, A.; Martinez-de-Oliveira, J., Antifuncal activity of the essential oil Thymus pulegioides on Candida, Aspergillus and dermatophyte species, Journal of Medical Microbiology, 2006, 55, 10, 1367-1373, https://doi.org/10.1099/jmm.0.46443-0 . [all data]

Salgueiro L.R., Pinto E., et al., 2006
Salgueiro L.R.; Pinto E.; Goncalves M.J.; Costa I.; Palmeira A.; Cavaleiro C.; Pina-Vaz C.; Rodrigues A.G.; Martinez-De-Oliveira J., Antifungal activity of the essential oil of Thymus capitellatus against Candida, Aspergillus and dermatophyte strains, Flavour Fragr. J., 2006, 21, 5, 749-753, https://doi.org/10.1002/ffj.1610 . [all data]

Boti J.B., Koukoua G., et al., 2005
Boti J.B.; Koukoua G.; N'Guessan T.Y.; Muselli A.; Bernardini A.F.; Casanova J., Composition of the leaf, stem bark and root bark oils of Isolona cooperi investigated by GC (retention index), GC-MS and C-13-NMR spectroscopy, Phytochem. Anal., 2005, 16, 5, 357-363, https://doi.org/10.1002/pca.857 . [all data]

Dob, Berramdane, et al., 2005
Dob, T.; Berramdane, T.; Chelgoum, C., Chemical composition of essential oil of Pinus halepensis Miller growing in Algeria, C.R. Chim., 2005, 8, 11-12, 1939-1945, https://doi.org/10.1016/j.crci.2005.05.007 . [all data]

Fanciullino, Gancel, et al., 2005
Fanciullino, A.-L.; Gancel, A.-L.; Froelicher, Y.; Luro, F.; Ollitrault, P.; Brillouet, J.-M., Effects of Nucleo-cytoplasmic Interactions on Leaf Volatile Compounds from Citrus Somatic Diploid Hybrids, J. Agric. Food Chem., 2005, 53, 11, 4517-4523, https://doi.org/10.1021/jf0502855 . [all data]

Gancel, Ollitrault, et al., 2005
Gancel, A.-L.; Ollitrault, P.; Froelicher, Y.; Tomi, F.; Jacquemond, C.; Luro, F.; Brillouet, J.-M., Leaf volatile compounds of six citrus somatic allotetraploid hybrids originating from various combinations of lime, lemon, citron, sweet orange, and grapefruit, J. Agric. Food Chem., 2005, 53, 6, 2224-2230, https://doi.org/10.1021/jf048315b . [all data]

Lee, Lee, et al., 2005
Lee, J.-G.; Lee, C.-G.; Kwag, J.-J.; Buglass, A.J.; Lee, G.-H., Determination of optimum conditions for the analysis of volatile components in pine needles by double-shot pyrolysis-gas chromatography-mass spectrometry, J. Chromatogr. A, 2005, 1089, 1-2, 227-234, https://doi.org/10.1016/j.chroma.2005.06.060 . [all data]

Paolini, Costa, et al., 2005
Paolini, J.; Costa, J.; Bernardini, A., Analysis of the essential oil from aerial parts of Eupatorium cannabinum subsp. corsicum (L.) by gas chromatography with electron impact and chemical ionization mass spectrometry, J. Chromatogr. A, 2005, 1076, 1-2, 170-178, https://doi.org/10.1016/j.chroma.2005.03.131 . [all data]

Vellutini, Baldovini, et al., 2005
Vellutini, M.; Baldovini, N.; de Rocca Serra, D. Tomi; Casanova, J., β-Cyclolavandulyl and β-isocyclolavandulyl esters from Peucedanum paniculatum L., an endemic species to Corsica, Phytochemistry, 2005, 66, 16, 1956-1962, https://doi.org/10.1016/j.phytochem.2005.07.001 . [all data]

Verzera, Trozzi, et al., 2005
Verzera, A.; Trozzi, A.; Zappala, M.; Condurso, C.; Cotroneo, A., Essential Oil Composition of Citrus meyerii Y. Tan. and Citrus medica L. cv. Diamante and Their Lemon Hybrids, J. Agric. Food Chem., 2005, 53, 12, 4890-4894, https://doi.org/10.1021/jf047879c . [all data]

Bertoli, Menichini, et al., 2004
Bertoli, A.; Menichini, F.; Noccioli, C.; Morelli, I.; Pistelli, L., Volatile constituents of different organs of Psoralea bituminosa L., Flavour Fragr. J., 2004, 19, 2, 166-171, https://doi.org/10.1002/ffj.1315 . [all data]

Bertoli, Pistelli, et al., 2004
Bertoli, A.; Pistelli, L.; Morelli, I.; Fraternale, D.; Giamperi, L.; Ricci, D., Volatile constituents of different parts (roots, stems and leaves) of Smyrnium olusatrum L., Flavour Fragr. J., 2004, 19, 6, 522-525, https://doi.org/10.1002/ffj.1382 . [all data]

Brophy, Goldsack, et al., 2004
Brophy, J.J.; Goldsack, R.J.; O'Sullivan, W., Chemistry of the Australian gymnosperms. Part VII. The leaf oils of the genus Actinostrobus, Biochem. Syst. Ecol., 2004, 32, 10, 867-873, https://doi.org/10.1016/j.bse.2004.05.001 . [all data]

Cavaleiro, Salgueiro, et al., 2004
Cavaleiro, C.; Salgueiro, L.R.; Miguel, M.G.; da Cunha, A.P., Analysis by gas chromatography?mass spectrometry of the volatile components of Teucrium lusitanicum and Teucrium algarbiensis, J. Chromatogr. A, 2004, 1033, 1, 187-190, https://doi.org/10.1016/j.chroma.2004.01.005 . [all data]

Flamini, Bader, et al., 2004
Flamini, G.; Bader, A.; Cioni, P.L.; Katbeh-Bader, A.; Morelli, I., Composition of the essential oil of leaves, galls, and ripe and unripe fruits of Jordian Pistacia palaestina Boiss., J. Agric. Food Chem., 2004, 52, 3, 572-576, https://doi.org/10.1021/jf034773t . [all data]

Flamini, Cioni, et al., 2004
Flamini, G.; Cioni, P.L.; Morelli, I.; Maccioni, S.; Baldini, R., Phytochemical typologies in some populations of Myrtus communis L. on Caprione Promontory (East Liguria, Italy), Food Chem., 2004, 85, 4, 599-604, https://doi.org/10.1016/j.foodchem.2003.08.005 . [all data]

Flamini, Luigi Cioni, et al., 2004
Flamini, G.; Luigi Cioni, P.; Morelli, I., Essential oils of Galeopsis pubescens and G. tetrahit from Tuscany (Italy), Flavour Fragr. J., 2004, 19, 4, 327-329, https://doi.org/10.1002/ffj.1307 . [all data]

Gonny, Bradesi, et al., 2004
Gonny, M.; Bradesi, P.; Casanova, J., Identification of the components of the essential oil from wild Corsican Daucus carota L. using 13C-NMR spectroscopy, Flavour Fragr. J., 2004, 19, 5, 424-433, https://doi.org/10.1002/ffj.1330 . [all data]

Grujic-Jovanovic, Skaltsa, et al., 2004
Grujic-Jovanovic, S.; Skaltsa, H.D.; Marin, P.; Sokovic, M., Composition and antibacterial activity of the essential oil of six Stachys species from Serbia, Flavour Fragr. J., 2004, 19, 2, 139-144, https://doi.org/10.1002/ffj.1275 . [all data]

Yu, Kim, et al., 2004
Yu, E.J.; Kim, T.H.; Kim, K.H.; Lee, H.J., Aroma-active compounds of Pinus densiflora (red pine) needles, Flavour Fragr. J., 2004, 19, 6, 532-537, https://doi.org/10.1002/ffj.1337 . [all data]

Yu, Kim, et al., 2004, 2
Yu, E.J.; Kim, T.H.; Kim, K.H.; Lee, H.J., Characterization of aroma-active compounds of Abies nephrolepis (Khingan fir) needles using aroma extract dilution analysis, Flavour Fragr. J., 2004, 19, 1, 74-79, https://doi.org/10.1002/ffj.1314 . [all data]

Zheng, Kim, et al., 2004
Zheng, C.H.; Kim, T.H.; Kim, K.H.; Leem, Y.H.; Lee, H.J., Characterization of potent aroma compounds in Chrysanthemum coronarium L. (Garland) using aroma extract dilution analysis, Flavour Fragr. J., 2004, 19, 5, 401-405, https://doi.org/10.1002/ffj.1447 . [all data]

Bader, Caponi, et al., 2003
Bader, A.; Caponi, C.; Cioni, P.L.; Flamini, G.; Morelli, I., Composition of the essential oil of Ballota undulata, B. nigra ssp. foetida and B. saxatilis, Flavour Fragr. J., 2003, 18, 6, 502-504, https://doi.org/10.1002/ffj.1257 . [all data]

Bader, Caponi, et al., 2003, 2
Bader, A.; Caponi, C.; Cioni, P.L.; Flamini, G.; Morelli, I., Acorenone in the essential oil of flowering aerial parts of Seseli tortuosum L., Flavour Fragr. J., 2003, 18, 1, 57-58, https://doi.org/10.1002/ffj.1154 . [all data]

Brat, Rega, et al., 2003
Brat, P.; Rega, B.; Alter, P.; Reynes, M.; Brillouet, J.-M., Distribution of volatile compounds in the pulp, cloud, and serum of freshly squeezed orange juice, J. Agric. Food Chem., 2003, 51, 11, 3442-3447, https://doi.org/10.1021/jf026226y . [all data]

Choi, 2003
Choi, H.-S., Character impact odorants of Citrus Hallabong [(C. unshiu Marcov × C. sinensis Osbeck) × C. reticulata Blanco] cold-pressed peel oil, J. Agric. Food Chem., 2003, 51, 9, 2687-2692, https://doi.org/10.1021/jf021069o . [all data]

Emilio Tomei, Manganelli, et al., 2003
Emilio Tomei, P.; Manganelli, R.E.U.; Flamini, G.; Cioni, P.L.; Morelli, I., Composition of the essential oil of Mentha microphylla from the Gennargentu Mountains (Sardinia, Italy), J. Agric. Food Chem., 2003, 51, 12, 3614-3617, https://doi.org/10.1021/jf026091w . [all data]

Gancel, Ollitrault, et al., 2003
Gancel, A.-L.; Ollitrault, P.; Froelicher, Y.; Tomi, F.; Jacquemond, C.; Luro, F.; Brillouet, J.-M., Leaf volatile compounds of seven citrus somatic tetraploid hybrids sharing willow leaf mandarin (Citrus deliciosa Ten.) as their common parent, J. Agric. Food Chem., 2003, 51, 20, 6006-6013, https://doi.org/10.1021/jf0345090 . [all data]

Shellie, Marriott, et al., 2003
Shellie, R.; Marriott, P.; Zappia, G.; Mondello, L.; Dugo, G., Interactive use of linear retention indices on polar and apolar columns with an MS-Library for reliable characterization of Australian tea tree and other Melaleuca sp. oils, J. Essent. Oil Res., 2003, 15, 5, 305-312, https://doi.org/10.1080/10412905.2003.9698597 . [all data]

Skaltsa, Demetzos, et al., 2003
Skaltsa, H.D.; Demetzos, C.; Lazari, D.; Sokovic, M., Essential oil analysis and antimicrobial activity of eight Stachys species from Greece, Phytochemistry, 2003, 64, 3, 743-752, https://doi.org/10.1016/S0031-9422(03)00386-8 . [all data]

Tzakou, Couladis, et al., 2003
Tzakou, O.; Couladis, M.; Slavkovska, V.; Mimica-Dukic, N.; Jancic, R., The essential oil composition of Salvia brachyodon Vandas, Flavour Fragr. J., 2003, 18, 1, 2-4, https://doi.org/10.1002/ffj.1132 . [all data]

Verzera, Trozzi, et al., 2003
Verzera, A.; Trozzi, A.; Gazea, F.; Cicciarelloi, G.; Cotroneo, A., Effects of rootstock on the composition of bergamot (Citrus bergamia Risso et Poiteau) essential oil, J. Agric. Food Chem., 2003, 51, 1, 206-210, https://doi.org/10.1021/jf0206872 . [all data]

Choi, Kim. M.-S.L., et al., 2002
Choi, H.-S.; Kim. M.-S.L.; Sawamura, M., Constituents of the essential oil of cnidium officinale Makino, a Korean medicinal plant, Flavour Fragr. J., 2002, 17, 1, 49-53, https://doi.org/10.1002/ffj.1038 . [all data]

Lota, de Rocca Serra, et al., 2002
Lota, M.-L.; de Rocca Serra, D.; Tomi, F.; Jacquemond, C.; Casanova, J., Volatile components of peel and leaf oils of lemon and lime species, J. Agric. Food Chem., 2002, 50, 4, 796-805, https://doi.org/10.1021/jf010924l . [all data]

Mondello, Zappia, et al., 2002
Mondello, L.; Zappia, G.; Cotroneo, A.; Bonaccorsi, I.; Chowdhury, J.U.; Yusuf, M.; Dugo, G., Studies on the essential oil-bearing plants of Bangladesh. Part VIII. Composition of some Ocimum oils O. basilicum L. var. purpurascens; O. sanctum L. green; O. sanctum L. purple; O. americanum L., citral type; O. americanum L., camphor type, Flavour Fragr. J., 2002, 17, 5, 335-340, https://doi.org/10.1002/ffj.1108 . [all data]

Pino, Marbot, et al., 2002
Pino, J.A.; Marbot, R.; Vázquez, C., Characterization of volatile in Cosa Rican Guava [Psidium friedrichsthalianum (Berg) Niedenzu] fruit, J. Agric. Food Chem., 2002, 50, 21, 6023-6026, https://doi.org/10.1021/jf011456i . [all data]

Couladis, Baziou, et al., 2001
Couladis, M.; Baziou, P.; Petrakis, P.V.; Harvala, C., Essential oil composition of Hypericum perfoliatum L. growing in different locations in Greece, Flavour Fragr. J., 2001, 16, 3, 204-206, https://doi.org/10.1002/ffj.979 . [all data]

Couladis, Tzakou, et al., 2001
Couladis, M.; Tzakou, O.; Stojanovic, D.; Mimica-Dukic, N.; Jancic, R., The essential oil composition of Salvia argentea L., Flavour Fragr. J., 2001, 16, 3, 227-229, https://doi.org/10.1002/ffj.989 . [all data]

Lota, Serra, et al., 2001
Lota, M.-L.; Serra, D.R.; Jacquemond, C.; Tomi, F.; Casanova, J., Chemical variability of peel and leaf essential oils of sour orange, Flavour Fragr. J., 2001, 16, 2, 89-96, https://doi.org/10.1002/1099-1026(200103/04)16:2<89::AID-FFJ950>3.0.CO;2-D . [all data]

Pino, Marbot, et al., 2001
Pino, J.A.; Marbot, R.; Vázquez, C., Characterization of volatiles in strawberry guava (Psidium cattleianum Sabine) fruit, J. Agric. Food Chem., 2001, 49, 12, 5883-5887, https://doi.org/10.1021/jf010414r . [all data]

Rezzi, Bighelli, et al., 2001
Rezzi, S.; Bighelli, A.; Mouillot, D.; Casanova, J., Composition and chemical variability of the needle essential oil of Pinus nigra subsp. laricio from corsica, Flavour Fragr. J., 2001, 16, 5, 379-383, https://doi.org/10.1002/ffj.1018 . [all data]

Baldovini, Ristorcelli, et al., 2000
Baldovini, N.; Ristorcelli, D.; Tomi, F.; Casanova, J., Infraspecific variability of the essential oil of Calamintha nepeta from Corsica (France), Flavour Fragr. J., 2000, 15, 1, 50-54, https://doi.org/10.1002/(SICI)1099-1026(200001/02)15:1<50::AID-FFJ871>3.0.CO;2-F . [all data]

Bartley and Jacobs, 2000
Bartley, J.P.; Jacobs, A.L., Effects of drying on flavour compounds in Australian-grown ginger (Zingiber officinale), J. Sci. Food Agric., 2000, 80, 2, 209-215, https://doi.org/10.1002/(SICI)1097-0010(20000115)80:2<209::AID-JSFA516>3.0.CO;2-8 . [all data]

Brophy, Goldsack, et al., 2000
Brophy, J.; Goldsack, R.J.; Bean, A.R.; Forster, P.I.; Lepschi, B.J., Leaf essential oils of the genus Leptospermum (Myrtaceae) in eastern Australia. Part 6. Leptospermum polygalifolium and allies, Flavour Fragr. J., 2000, 15, 4, 271-277, https://doi.org/10.1002/1099-1026(200007/08)15:4<271::AID-FFJ910>3.0.CO;2-E . [all data]

Brophy, Goldsack, et al., 2000, 2
Brophy, J.J.; Goldsack, R.J.; Punruckvong, A.; Bean, A.R.; Forster, P.I.; Lepschi, B.J.; Doran, J.C.; Rozefelds, A.C., Leaf essential oils of the genus Leptospermum (Myrtaceae) in eastern Australia. Part 7. Leptospermum petersonii, L. liversidgei and allies, Flavour Fragr. J., 2000, 15, 5, 342-351, https://doi.org/10.1002/1099-1026(200009/10)15:5<342::AID-FFJ924>3.0.CO;2-V . [all data]

Chagonda, Makanda, et al., 2000
Chagonda, L.S.; Makanda, C.D.; Chalchat, J.-C., The essential oils of Ocimum canum Sims (basilic camphor) and Ocimum urticifolia Roth from Zimbabwe, Flavour Fragr. J., 2000, 15, 1, 23-26, https://doi.org/10.1002/(SICI)1099-1026(200001/02)15:1<23::AID-FFJ866>3.0.CO;2-W . [all data]

Choi and Sawamura, 2000
Choi, H.-S.; Sawamura, M., Composition of the essential oil of Citrus tamurana Hort. ex Tanaka (Hyuganatsu), J. Agric. Food Chem., 2000, 48, 10, 4868-4873, https://doi.org/10.1021/jf000651e . [all data]

Kim, Thuy, et al., 2000
Kim, T.H.; Thuy, N.T.; Shin, J.H.; Baek, H.H.; Lee, H.J., Aroma-active compounds of miniature beefsteakplant (Mosla dianthera Maxim.), J. Agric. Food Chem., 2000, 48, 7, 2877-2881, https://doi.org/10.1021/jf000219x . [all data]

Lazari, Skaltsa, et al., 2000
Lazari, D.M.; Skaltsa, H.D.; Constantinidis, T., Volatile constituents of Cerastium candidissimum, a Greek endemic species, Flavour Fragr. J., 2000, 15, 3, 174-176, https://doi.org/10.1002/1099-1026(200005/06)15:3<174::AID-FFJ886>3.0.CO;2-Y . [all data]

Lota, de Rocca Serra, et al., 2000
Lota, M.-L.; de Rocca Serra, D.; Tomi, F.; Casanova, J., Chemical variability of peel and leaf essential oils of mandarins from Citrus reticulata Blanco, Biochem. Syst. Ecol., 2000, 28, 1, 61-78, https://doi.org/10.1016/S0305-1978(99)00036-8 . [all data]

Verzera, Trozzi, et al., 2000
Verzera, A.; Trozzi, A.; Cotroneo, A.; Lorenzo, D.; Dellacassa, E., Uruguayan essential oil. 12. Composition of Nova and Satsuma mandarin oils, J. Agric. Food Chem., 2000, 48, 7, 2903-2909, https://doi.org/10.1021/jf990734z . [all data]

Brophy, Goldsack, et al., 1999
Brophy, J.J.; Goldsack, R.J.; Bean, A.R.; Forster, P.I.; Lepschi, B.J., Leaf essential oils of the genus Leptospermum (Myrtaceae) in eastern Australia. Part 5. Leptospermum continentale and allies, Flavour Fragr. J., 1999, 14, 2, 98-104, https://doi.org/10.1002/(SICI)1099-1026(199903/04)14:2<98::AID-FFJ797>3.0.CO;2-V . [all data]

Lota, Serra, et al., 1999
Lota, M.-L.; Serra, D.R.; Tomi, F.; Bessiere, J.-M.; Casanova, J., Chemical composition of peel and leaf essential oils of Citrus medica L. and C. limonimedica Lush., Flavour Fragr. J., 1999, 14, 3, 161-166, https://doi.org/10.1002/(SICI)1099-1026(199905/06)14:3<161::AID-FFJ801>3.0.CO;2-8 . [all data]

Stashenko, Cervantes, et al., 1999
Stashenko, E.E.; Cervantes, M.; Combariza, Y.; Fuentes, H.; Martínez, J.R., HRGC/FID and HRGC/MSD analysis of the secondary metabolites obtained by different extraction methods from Lepechinia schiedeana, an in vitro evaluation of its antioxidant activity, J. Hi. Res. Chromatogr., 1999, 22, 6, 343-349, https://doi.org/10.1002/(SICI)1521-4168(19990601)22:6<343::AID-JHRC343>3.0.CO;2-J . [all data]

Bicchi, Rubiolo, et al., 1998
Bicchi, C.; Rubiolo, P.; Marschall, H.; Weyerstahl, P.; Laurent, R., Constituents of Artemisia roxburghiana Besser essential oil, Flavour Fragr. J., 1998, 13, 1, 40-46, https://doi.org/10.1002/(SICI)1099-1026(199801/02)13:1<40::AID-FFJ688>3.0.CO;2-Z . [all data]

Brophy, Goldsack, et al., 1998
Brophy, J.J.; Goldsack, R.J.; Forster, P.I.; Bean, A.R.; Clarkson, J.R.; Lepschi, B.J., Leaf essential oils of the genus Leptospermum (Myrtaceae) in Eastern Australia. Part 1. Leptospermum brachyandrum and Leptospermum pallidum groups, Flavour Fragr. J., 1998, 13, 1, 19-25, https://doi.org/10.1002/(SICI)1099-1026(199801/02)13:1<19::AID-FFJ679>3.0.CO;2-9 . [all data]

Brophy, Goldsack, et al., 1998, 2
Brophy, J.J.; Goldsack, R.J.; Bean, A.R.; Forster, P.I.; Lepschi, B.J., Leaf essential oils of the genus Leptospermum (Myrtaceae) in eastern Australia. Part 2. Leptospermum blakelyi and allies, Flavour Fragr. J., 1998, 13, 5, 353-358, https://doi.org/10.1002/(SICI)1099-1026(1998090)13:5<353::AID-FFJ759>3.0.CO;2-1 . [all data]

Bicchi, Fresia, et al., 1997
Bicchi, C.; Fresia, M.; Rubiolo, P.; Monti, D.; Franz, C.; Goehler, I., Constituents of Tagetes lucida Cav. ssp. lucida essential oil, Flavour Fragr. J., 1997, 12, 1, 47-52, https://doi.org/10.1002/(SICI)1099-1026(199701)12:1<47::AID-FFJ610>3.0.CO;2-7 . [all data]

Brophy, Goldsack, et al., 1997
Brophy, J.J.; Goldsack, R.J.; Forster, P.I., The leaf essential oils of the Australian species of Rhodamnia (Myrtaceae), Flavour Fragr. J., 1997, 12, 5, 345-354, https://doi.org/10.1002/(SICI)1099-1026(199709/10)12:5<345::AID-FFJ658>3.0.CO;2-6 . [all data]

Sagrero-Nieves, Bartley, et al., 1997
Sagrero-Nieves, L.; Bartley, J.P.; Griselda Espinosa, B.; Dominguez, X.A.; Julia Verde S., Essential oil composition of Aristolochia brevipes Benth., Flavour Fragr. J., 1997, 12, 6, 401-403, https://doi.org/10.1002/(SICI)1099-1026(199711/12)12:6<401::AID-FFJ673>3.0.CO;2-D . [all data]

Chyau, Mau, et al., 1996
Chyau, C.-C.; Mau, J.-L.; Wu, C.-M., Characteristics of the steam-distilled oil and carbon dioxide extract of Zanthoxylum simulans and fruits, J. Agric. Food Chem., 1996, 44, 4, 1096-1099, https://doi.org/10.1021/jf950577d . [all data]

Stashenko, Prada, et al., 1996
Stashenko, E.E.; Prada, N.Q.; Martínez, J.R., HRGC/FID/NP and HRGC/MSD study of Colombian Ylang-Ylang (Cananga odorata) oils obtained by different extraction techniques, J. Hi. Res. Chromatogr., 1996, 19, 6, 353-358, https://doi.org/10.1002/jhrc.1240190609 . [all data]

Píry, Príbela, et al., 1995
Píry, J.; Príbela, A.; Durcanská, J.; Farkas, P., Fractionation of volatiles from blackcurrant (Ribes nigrum L.) by different extractive methods, Food Chem., 1995, 54, 1, 73-77, https://doi.org/10.1016/0308-8146(95)92665-7 . [all data]

Stashenko, Wiame, et al., 1995
Stashenko, E.; Wiame, H.; Dassy, S.; Martinez, J.R.; Shibamoto, T., Catalytic transformation of copaiba (Copaifera officinalis) oil over zeolite ZSM-5, J. Hi. Res. Chromatogr., 1995, 18, 1, 54-58, https://doi.org/10.1002/jhrc.1240180112 . [all data]

Chung, Eiserich, et al., 1993
Chung, T.Y.; Eiserich, J.P.; Shibamoto, T., Volatile compounds isolated from edible Korean chamchwi (Aster scaber Thunb), J. Agric. Food Chem., 1993, 41, 10, 1693-1697, https://doi.org/10.1021/jf00034a033 . [all data]

Le Quere and Latrasse, 1990
Le Quere, J.-L.; Latrasse, A., Composition of the Essential Oils of Blackcurrant Buds (Ribes nigrum L.), J. Agric. Food Chem., 1990, 38, 1, 3-10, https://doi.org/10.1021/jf00091a001 . [all data]