Pyridine, 2-(1-methyl-2-pyrrolidinyl)-

Normal alkane RI, polar column, isothermal

Data compiled by: NIST Mass Spectrometry Data Center, William E. Wallace, director

Column type CapillaryCapillaryCapillary
Active phase Carbowax 20M / KOHCarbowax 20M / KOHCarbowax 20M / KOH
Column length (m)
Carrier gas
Substrate
Column diameter (mm)
Phase thickness (μm)
Temperature (C) 150.150.150.
I 1865.1876.1887.
ReferenceCaddy, Fish, et al., 1973Caddy, Fish, et al., 1973Caddy, Fish, et al., 1973
Comment MSDC-RI MSDC-RI MSDC-RI

Normal alkane RI, polar column, temperature ramp

Data compiled by: NIST Mass Spectrometry Data Center, William E. Wallace, director

Column type Capillary
Active phase Carbowax 20M
Column length (m) 39.
Carrier gas H2
Substrate
Column diameter (mm) 0.30
Phase thickness (μm)
Tstart (C) 60.
Tend (C) 220.
Heat rate (K/min) 2.
Initial hold (min)
Final hold (min)
I 1829.
ReferenceLiardon and Ledermann, 1980
Comment MSDC-RI

Kovats' RI, non-polar column, isothermal

Data compiled by: NIST Mass Spectrometry Data Center, William E. Wallace, director

Column type CapillaryCapillaryCapillaryPackedPacked
Active phase OV-1BP-1BP-1SE-30OV-101
Column length (m)  25.25.2.2.
Carrier gas  N2N2N2N2
Substrate    1% se-30 on Anachrom ABS(80-100mesh)
Column diameter (mm)  0.220.53
Phase thickness (μm)  0.251.
Temperature (C) 160.130.130.160.200.
I 1362.1328.1327.1360.1377.
ReferenceErdmann, Rochholz, et al., 1992Japp, Gill, et al., 1987Japp, Gill, et al., 1987Musumarra, Scarlata, et al., 1987Huber, Kenndler, et al., 1979
Comment MSDC-RI MSDC-RI MSDC-RI MSDC-RI MSDC-RI
Column type PackedPackedPackedPackedPacked
Active phase Apiezon LOV-1Apiezon LOV-101OV-101
Column length (m)    2.2.
Carrier gas    N2N2
Substrate   Chromosorb WChromosorb WChromosorb W
Column diameter (mm)
Phase thickness (μm)
Temperature (C) 150.150.150.150.190.
I 1355.1345.1355.1341.1370.
ReferenceHuber, Kenndler, et al., 1979Berninger and Möller, 1977Donike and Stratmann, 1976Möller, 1976Möller, 1976
Comment MSDC-RI MSDC-RI MSDC-RI MSDC-RI MSDC-RI

References

Caddy, Fish, et al., 1973
Caddy, B.; Fish, F.; Scott, D., Chromatographic screening for drugs of abuse using capillary columds. II. Peak identification on support coated open tubular columns for a series of central nervous system stimulating drugs, Chromatographia, 1973, 6, 7, 293-300, https://doi.org/10.1007/BF02269329 . [all data]