1,2-Bis(dimethylphosphino)ethane

Phase change data

Data compiled by: Robert L. Brown and Stephen E. Stein

Quantity Value Units Method Reference Comment
Tboil461.2KN/ABuckingham and Donaghy, 1982
Quantity Value Units Method Reference Comment
Tfus272. - 273.KN/ABuckingham and Donaghy, 1982

Reduced pressure boiling point

Tboil (K) Pressure (bar) Reference
354. - 355.0.035Buckingham and Donaghy, 1982

References

Buckingham and Donaghy, 1982
Buckingham, J.; Donaghy, S.M., Dictionary of Organic Compounds: Fifth Edition, Chapman and Hall, New York, 1982, 1. [all data]