Cinepazet

Kovats' RI, non-polar column, isothermal

Data compiled by: NIST Mass Spectrometry Data Center, William E. Wallace, director

Column type Packed
Active phase SE-30
Column length (m) 2.
Carrier gas N2
Substrate 1% se-30 on Anachrom ABS(80-100mesh)
Column diameter (mm)
Phase thickness (μm)
Temperature (C) 280.
I 2924.
ReferenceMusumarra, Scarlata, et al., 1987
Comment MSDC-RI

References

Musumarra, Scarlata, et al., 1987
Musumarra, G.; Scarlata, G.; Romano, G.; Cappello, G.; Clementi, S.; Giulietti, G., Qualitative organic analysis. Part 2. Identification of drugs by principal components analysis of standardized TLC data in four eluent systems and of retention indices on SE 30, J. Anal. Toxicol., 1987, 11, 4, 154-163, https://doi.org/10.1093/jat/11.4.154 . [all data]