peroxylauric acid

Condensed phase thermochemistry data

Data compiled by: Hussein Y. Afeefy, Joel F. Liebman, and Stephen E. Stein

Quantity Value Units Method Reference Comment
Δcsolid-1785.8 ± 2.0kcal/molCcbSwain, Silbert, et al., 1964Corresponding Δfsolid = -162.6 kcal/mol (simple calculation by NIST; no Washburn corrections)

Phase change data

Data compiled by: William E. Acree, Jr., James S. Chickos

Quantity Value Units Method Reference Comment
Δsub31.41 ± 0.41kcal/molMESwain, Kwan, et al., 1980Based on data from 293. - 303. K.

References

Swain, Silbert, et al., 1964
Swain, H.A., Jr.; Silbert, L.S.; Miller, J.G., The heats of combustion of aliphatic long chain peroxyacids, t-butyl peroxyesters, and related acids and esters, J. Am. Chem. Soc., 1964, 86, 2562-2566. [all data]

Swain, Kwan, et al., 1980
Swain, H.A.; Kwan, Chiu-Yin; Sung, Ho-Nan, Measurement of vapor pressures from 20 to 30.degree.C of long-chain peroxy acids, J. Phys. Chem., 1980, 84, 11, 1347-1349, https://doi.org/10.1021/j100448a012 . [all data]