dibromoethylaluminium

Reaction thermochemistry data

Data compiled by: José A. Martinho Simões

Individual Reactions

C2H5AlBr2 (l) + Aluminum, triethyl- (l) = 2C4H10AlBr (l)

By formula: C2H5AlBr2 (l) + C6H15Al (l) = 2C4H10AlBr (l)

Quantity Value Units Method Reference Comment
Δr-39.7 ± 0.8kJ/molRSCSmith, 1974Please also see Pedley and Rylance, 1977.

C2H5AlBr2 (l) + C4H10AlBr (l) = C6H15Al2Br3 (l)

By formula: C2H5AlBr2 (l) + C4H10AlBr (l) = C6H15Al2Br3 (l)

Quantity Value Units Method Reference Comment
Δr-2.5 ± 0.2kJ/molRSCSmith, 1974Please also see Pedley and Rylance, 1977.

References

Smith, 1974
Smith, M.B., J. Organometal. Chem., 1974, 76, 171. [all data]

Pedley and Rylance, 1977
Pedley, J.B.; Rylance, J., Computer Analysed Thermochemical Data: Organic and Organometallic Compounds, University of Sussex, Brigton, 1977. [all data]