4-Acetyl-3,5-dimethyl-1H-pyrrole-2-carboxylic acid, ethyl ester

Condensed phase thermochemistry data

Data compiled by: Hussein Y. Afeefy, Joel F. Liebman, and Stephen E. Stein

Quantity Value Units Method Reference Comment
Δfsolid-654.5 ± 5.9kJ/molCcbRothemund and Beyer, 1932Reanalyzed by Cox and Pilcher, 1970, Original value = -643.1 ± 5.9 kJ/mol; Author's Hf=-158.0±1.20
Quantity Value Units Method Reference Comment
Δcsolid-5817.9 ± 5.9kJ/molCcbRothemund and Beyer, 1932Reanalyzed by Cox and Pilcher, 1970, Original value = -5829.1 ± 5.9 kJ/mol; Author's Hf=-158.0±1.20

References

Rothemund and Beyer, 1932
Rothemund, P.; Beyer, H., Calorimetrische bestimmungen bei einfachen pyrrolen, Ann. Chim., 1932, 492, 292-298. [all data]

Cox and Pilcher, 1970
Cox, J.D.; Pilcher, G., Thermochemistry of Organic and Organometallic Compounds, Academic Press, New York, 1970, 1-636. [all data]