1,trans-3-heptadiene

Gas phase ion energetics data

Data compiled as indicated in comments:
LLK - Sharon G. Lias, Rhoda D. Levin, and Sherif A. Kafafi

Ionization energy determinations

IE (eV) Method Reference Comment
8.47PEMasclet, Mouvier, et al., 1981LLK
8.48PEMasclet, Mouvier, et al., 1981Vertical value; LLK

Kovats' RI, non-polar column, isothermal

View large format table.

Column type Active phase Temperature (C) I Reference Comment
CapillarySqualane70.713.1Soják, Ostrovský, et al., 1980N2; Column length: 200. m; Column diameter: 0.25 mm
CapillarySqualane70.708.8Soják, Ostrovský, et al., 1980N2; Column length: 70. m; Column diameter: 0.25 mm

References

Masclet, Mouvier, et al., 1981
Masclet, P.; Mouvier, G.; Bocquet, J.F., Effets electroniques et effets steriques dus a la substitution alcoyle dans les dienes conjugues, J. Chim. Phys., 1981, 78, 99. [all data]

Soják, Ostrovský, et al., 1980
Soják, L.; Ostrovský, I.; Leclercq, P.A.; Rijks, J.A., Identification of n-hepta- and n-octadienes by high-resolution gas chromatography using structure-retention correlations and mass spectrometry, J. Chromatogr., 1980, 191, 187-198, https://doi.org/10.1016/S0021-9673(00)86379-7 . [all data]