1-Ethyldecaborane(14)

Gas phase ion energetics data

Data compiled by: Henry M. Rosenstock, Keith Draxl, Bruce W. Steiner, and John T. Herron

Ionization energy determinations

IE (eV) Method Reference
9.0 ± 0.5EIMargrave, 1960

References

Margrave, 1960
Margrave, J.L., Ionization potentials of B5H9, B5H8I, B10H14, and B10H13C2H5 from electron impact studies, J. Chem. Phys., 1960, 32, 1889. [all data]