(E)-1-(Prop-1-en-1-yl)-3-propyltrisulfane

Van Den Dool and Kratz RI, non-polar column, temperature ramp

Data compiled by: NIST Mass Spectrometry Data Center, William E. Wallace, director

Column type CapillaryCapillaryCapillaryCapillaryCapillary
Active phase HP-1HP-1OV-1OV-1OV-1
Column length (m) 50.50.183.183.183.
Carrier gas HeHe N2N2
Substrate
Column diameter (mm) 0.320.320.762
Phase thickness (μm) 1.051.05
Tstart (C) 40.40.0.0.0.
Tend (C) 260.260.230.230.230.
Heat rate (K/min) 2.2.1.1.1.
Initial hold (min)
Final hold (min)
I 1318.1320.1322.1310.1317.
ReferenceKuo and Ho, 1992Kuo and Ho, 1992, 2Schreyen, Dirinck, et al., 1976Schreyen, Dirinck, et al., 1976, 2Schreyen, Dirinck, et al., 1976, 2
Comment MSDC-RI MSDC-RI MSDC-RI MSDC-RI MSDC-RI

References

Kuo and Ho, 1992
Kuo, M.-C.; Ho, C.-T., Volatile constituents of the distilled oils of Welsh onions (Allium fistulosum L. variety Maichuon) and scallions (Allium fistulosum L. variety Caespitosum), J. Agric. Food Chem., 1992, 40, 1, 111-117, https://doi.org/10.1021/jf00013a021 . [all data]

Kuo and Ho, 1992, 2
Kuo, M.-C.; Ho, C.-T., Volatile constituents of the solvent extracts of Welsh onions (Allium fistulosum L. variety Maichuon) and scallions (A. fistulosum L. variety caepitosum), J. Agric. Food Chem., 1992, 40, 10, 1906-1910, https://doi.org/10.1021/jf00022a036 . [all data]

Schreyen, Dirinck, et al., 1976
Schreyen, L.; Dirinck, P.; van Wassenhove, F.; Schamp, N., Analysis of leek volatiles by headspace condensation, J. Agric. Food Chem., 1976, 24, 6, 1147-1152, https://doi.org/10.1021/jf60208a023 . [all data]

Schreyen, Dirinck, et al., 1976, 2
Schreyen, L.; Dirinck, P.; van Wassenhove, F.; Schamp, N., Volatile flavor components of leek, J. Agric. Food Chem., 1976, 24, 2, 336-341, https://doi.org/10.1021/jf60204a056 . [all data]