(E)-1-Methyl-3-(prop-1-en-1-yl)trisulfane

Van Den Dool and Kratz RI, non-polar column, custom temperature program

View large format table.

Column type Active phase I Reference Comment
CapillaryHP-5MS1169.Andriamaharavo, 201430. m/0.25 mm/0.25 μm, He; Program: 60C (1 min) => 5 C/min => 210C => 10 C/min => 280C (15 min)
CapillarySPB-11144.Mochizuki, Yamamoto, et al., 199830. m/0.32 mm/4.0 μm, N2; Program: 40 0C (10 min), 2 0C/min to 180 0C, 25 0C/min to 250 0C (5 min)

Normal alkane RI, non-polar column, temperature ramp

View large format table.

Column type Active phase I Reference Comment
CapillaryDB-11153.Hanum, Sinha, et al., 199530. m/0.25 mm/0.25 μm, He, 5. K/min; Tstart: 35. C; Tend: 150. C
CapillaryDB-11158.Hanum, Sinha, et al., 199530. m/0.25 mm/0.25 μm, He, 5. K/min; Tstart: 35. C; Tend: 150. C
CapillaryDB-51160.Sinha, Guyer, et al., 1992He, 2. K/min; Column length: 30. m; Column diameter: 0.2 mm; Tstart: 30. C; Tend: 200. C
CapillaryDB-51170.Sinha, Guyer, et al., 1992He, 2. K/min; Column length: 30. m; Column diameter: 0.2 mm; Tstart: 30. C; Tend: 200. C

References

Andriamaharavo, 2014
Andriamaharavo, N.R., Retention Data. NIST Mass Spectrometry Data Center., NIST Mass Spectrometry Data Center, 2014. [all data]

Mochizuki, Yamamoto, et al., 1998
Mochizuki, E.; Yamamoto, T.; Komiyama, Y.; Nakazawa, H., Identification of allium products using flame photometric detection gas chromatography and distribution patterns of volatile sulfur compounds, J. Agric. Food Chem., 1998, 46, 12, 5170-5176, https://doi.org/10.1021/jf9803076 . [all data]

Hanum, Sinha, et al., 1995
Hanum, T.; Sinha, N.K.; Guyer, D.E.; Cash, J.N., Pyruvate and flavor development in macerated onions (Allium cepa L.) by γ-glutamyl transpeptidase and exogenous C-S lyase, Food Chem., 1995, 54, 2, 183-188, https://doi.org/10.1016/0308-8146(95)00027-G . [all data]

Sinha, Guyer, et al., 1992
Sinha, N.K.; Guyer, D.E.; Gage, D.A.; Lira, C.T., Supercritical carbon dioxide extraction of onion flavors and their analysis by gas chromatography-mass spectrometry, J. Agric. Food Chem., 1992, 40, 5, 842-845, https://doi.org/10.1021/jf00017a027 . [all data]