(E)-1-Methyl-2-(prop-1-en-1-yl)disulfane

Van Den Dool and Kratz RI, non-polar column, temperature ramp

Data compiled by: NIST Mass Spectrometry Data Center, William E. Wallace, director

Column type Capillary
Active phase OV-101
Column length (m) 50.
Carrier gas He
Substrate
Column diameter (mm) 0.32
Phase thickness (μm)
Tstart (C) 50.
Tend (C) 250.
Heat rate (K/min) 4.
Initial hold (min)
Final hold (min)
I 1104.
ReferenceMisharina and Golovnya, 1989
Comment MSDC-RI

Kovats' RI, non-polar column, isothermal

Data compiled by: NIST Mass Spectrometry Data Center, William E. Wallace, director

Column type Capillary
Active phase OV-101
Column length (m) 50.
Carrier gas He
Substrate
Column diameter (mm) 0.32
Phase thickness (μm)
Temperature (C) 130.
I 1110.
ReferenceMisharina and Golovnya, 1989
Comment MSDC-RI

References

Misharina and Golovnya, 1989
Misharina, T.A.; Golovnya, R.V., Regularities of retention of a pseudohomologous series of dialkylpolysulfides in capillary gas chromatography, Zh. Anal. Khim., 1989, 44, 514-519. [all data]