1,2-Dicarbadodecaborane(12), 1-butyl-

Phase change data

Data compiled by: William E. Acree, Jr., James S. Chickos

Quantity Value Units Method Reference Comment
Δvap77.3 ± 3.8kJ/molEBShul'tse, Varushchenko, et al., 1980Based on data from 433. - 534. K.

Enthalpy of vaporization

ΔvapH (kJ/mol) Temperature (K) Method Reference Comment
50.6 ± 1.3571.EBShul'tse, Varushchenko, et al., 1980Based on data from 433. - 534. K.

Gas phase ion energetics data

Data compiled by: Sharon G. Lias and Joel F. Liebman

Ionization energy determinations

IE (eV) Method Reference
9.40PIOrlov, Pustobaev, et al., 1989

References

Shul'tse, Varushchenko, et al., 1980
Shul'tse, P.; Varushchenko, R.M.; Gal'chenko, G.L.; Klimova, T.V.; Stanko, V.I., Russ. J. Gen. Chem., 1980, 50, 1482. [all data]

Orlov, Pustobaev, et al., 1989
Orlov, W.M.; Pustobaev, V.N.; Poroshina, T.Yu.; O'shevskaya, V.A.; Zakharkin, L.I.; Gal'chenko, G.L., Ionization energies of C-monoalkyl substituted ortho- and metacarboranes-12, Dokl. Phys. Chem., 1989, 309, 968, In original 892. [all data]