2-Mercapto-1,3-benzoxazole

Phase change data

Data compiled by: William E. Acree, Jr., James S. Chickos

Enthalpy of fusion

ΔfusH (kJ/mol) Temperature (K) Method Reference
22.6 ± 0.9468.3DSCMentado, Flores, et al., 2008
25.0470.DSCTemprado, Roux, et al., 2008

Gas phase ion energetics data

Data compiled by: Sharon G. Lias, Rhoda D. Levin, and Sherif A. Kafafi

Ionization energy determinations

IE (eV) Method Reference
8.14PEGuimon, Arbelot, et al., 1975

References

Mentado, Flores, et al., 2008
Mentado, Juan; Flores, Henoc; Amador, Patricia, Combustion energies and formation enthalpies of 2-SH-benzazoles, The Journal of Chemical Thermodynamics, 2008, 40, 7, 1106-1109, https://doi.org/10.1016/j.jct.2008.02.018 . [all data]

Temprado, Roux, et al., 2008
Temprado, Manuel; Roux, Maria Victoria; Parameswar, Archana R.; Demchenko, Alexei V.; Chickos, James S.; Liebman, Joel F., Thermophysical properties in medium temperature range of several thio and dithiocarbamates, J Therm Anal Calorim, 2008, 91, 2, 471-475, https://doi.org/10.1007/s10973-007-8345-8 . [all data]

Guimon, Arbelot, et al., 1975
Guimon, C.; Arbelot, M.; Pfister-Guillouzo, G., Structure electronique de derives sulfures-VIII. Spectres photoelectroniques et electroniques d'J. Heterocycl. Chem. thiocarbonyles benzo-substitues, Spectrochim. Acta Part A, 1975, 31, 985. [all data]