Pyrene, 1-methyl-

Van Den Dool and Kratz RI, non-polar column, temperature ramp

Data compiled by: NIST Mass Spectrometry Data Center, William E. Wallace, director

Column type CapillaryCapillaryCapillary
Active phase SE-52SE-52SE-52
Column length (m) 33.365.65.
Carrier gas HeN2N2
Substrate
Column diameter (mm) 0.500.30.3
Phase thickness (μm)
Tstart (C) 50.100.100.
Tend (C) 320.300.300.
Heat rate (K/min) 6.1.81.8
Initial hold (min) 5.
Final hold (min)
I 2212.2215.2220.
ReferenceBeernaert, 1979Carugno and Rossi, 1967Carugno and Rossi, 1967
Comment MSDC-RI MSDC-RI MSDC-RI

Lee's RI, non-polar column, custom temperature program

Data compiled by: NIST Mass Spectrometry Data Center, William E. Wallace, director

Column type CapillaryCapillaryCapillaryCapillaryCapillary
Active phase DB-5HP-5MSHP-5MSHP-5MSHP-5MS
Column length (m) 60.30.30.30.30.
Carrier gas  HeHeHeHe
Substrate
Column diameter (mm)  0.250.250.250.25
Phase thickness (μm)  0.250.250.250.25
Program not specified60C(2min) => 6C/min => 258C => 2C/min => 300C(4min)not specifiednot specifiednot specified
I 373.4373.55373.45373.55373.72
ReferenceFuentes, Font, et al., 2007Wang, Li, et al., 2007Wang, Li, et al., 2007, 2Wang, Li, et al., 2007, 2Wang, Li, et al., 2007, 2
Comment MSDC-RI MSDC-RI MSDC-RI MSDC-RI MSDC-RI
Column type CapillaryCapillaryCapillaryCapillaryCapillary
Active phase 5 % Phenyl methyl siloxaneHP-5MSUltra-1DB-5LM-5
Column length (m)  30.50.30.30.
Carrier gas  HeNitrogen He
Substrate
Column diameter (mm)  0.300.320.250.25
Phase thickness (μm)  0.250.500.250.25
Program 70 0C (2 min) 30 0C/min -> 150 0C 5 0C/min -> 200 0C 4 0C/min -> 310 0C (5 min)50 0C (2 min) 8 0C/min -> 120 0C (3 min) 10 0C/min -> 230 0C40-100 0C 3-15 0C/min -> 290 0Cnot specified60C(2min) => 15C/min => 180C => 5C/min => 280C(5min)
I 370.00415.27373.6374.2371.86
ReferenceSkrbic and Onjia, 2006Cheng, Liu, et al., 2005Sremac, Skrbic, et al., 2005Lundstedt, Haglund, et al., 2003Ré-Poppi and Santiago-Silva, 2002
Comment MSDC-RI MSDC-RI MSDC-RI MSDC-RI MSDC-RI
Column type CapillaryCapillaryCapillaryCapillaryCapillary
Active phase DB-5DB-5SE-52SE-52SE-52
Column length (m) 30.30.
Carrier gas
Substrate
Column diameter (mm) 0.320.32
Phase thickness (μm)
Program not specifiednot specifiednot specifiednot specifiednot specified
I 372.97373.55368.09370.88371.43
ReferenceNaikwadi, Charbonneau, et al., 1987Naikwadi, Charbonneau, et al., 1987Shlyakhov, 1984Shlyakhov, 1984Shlyakhov, 1984
Comment MSDC-RI MSDC-RI MSDC-RI MSDC-RI MSDC-RI
Column type CapillaryCapillaryCapillaryCapillaryCapillary
Active phase SE-52SE-52SE-52SE-52SE-52
Column length (m)
Carrier gas
Substrate
Column diameter (mm)
Phase thickness (μm)
Program not specifiednot specifiednot specifiednot specifiednot specified
I 371.73373.00373.55368.09370.65
ReferenceShlyakhov, 1984Shlyakhov, 1984Shlyakhov, 1984Shlyakhov, 1984Shlyakhov, 1984
Comment MSDC-RI MSDC-RI MSDC-RI MSDC-RI MSDC-RI
Column type Capillary
Active phase SE-52
Column length (m)
Carrier gas
Substrate
Column diameter (mm)
Phase thickness (μm)
Program not specified
I 372.88
ReferenceShlyakhov, 1984
Comment MSDC-RI

References

Beernaert, 1979
Beernaert, H., Gas Chromatographic Analysis of Polyclylic Aromatic Hydrocarbons, J. Chromatogr., 1979, 173, 1, 109-118, https://doi.org/10.1016/S0021-9673(01)80450-7 . [all data]

Carugno and Rossi, 1967
Carugno, N.; Rossi, S., Evaluation of polynuclear hydrocarbons in cigarette smoke by glass capillary columns, J. Gas Chromatogr., 1967, 5, 2, 103-106, https://doi.org/10.1093/chromsci/5.2.103 . [all data]