3-Methyl-2-thiophenecarboxylic acid

Phase change data

Data compiled by: William E. Acree, Jr., James S. Chickos

Quantity Value Units Method Reference Comment
Δsub98.0 ± 0.4kJ/molMERibeiro da Silva and Santos, 2008Based on data from 312. - 334. K.

Enthalpy of sublimation

ΔsubH (kJ/mol) Temperature (K) Method Reference Comment
96.7 ± 0.4323.2MERibeiro da Silva and Santos, 2008Based on data from 312. - 334. K.

Van Den Dool and Kratz RI, polar column, custom temperature program

View large format table.

Column type Active phase I Reference Comment
CapillaryDB-FFAP2501.Huynh-Ba, Matthey-Doret, et al., 200330. m/0.32 mm/0.25 μm; Program: 35C(2min) => 6C/min => 180C => 10C/min => 240C (10min)

References

Ribeiro da Silva and Santos, 2008
Ribeiro da Silva, Manuel A.V.; Santos, Ana Filipa L.O.M., Thermochemical properties of three 2-thiophenecarboxylic acid derivatives, The Journal of Chemical Thermodynamics, 2008, 40, 9, 1451-1457, https://doi.org/10.1016/j.jct.2008.04.013 . [all data]

Huynh-Ba, Matthey-Doret, et al., 2003
Huynh-Ba, T.; Matthey-Doret, W.; Fay, L.B.; Rhlid, R.B., Generation of thiols by biotransformation of cysteine-aldehyde conjugates with Baker's yeast, J. Agric. Food Chem., 2003, 51, 12, 3629-3635, https://doi.org/10.1021/jf026198j . [all data]