tetrakis(1,1,1,2,2,3,3-heptafluoro-7,7-dimethyloctane-4,6-dione)uranium(IV)

Phase change data

Data compiled by: William E. Acree, Jr., James S. Chickos

Enthalpy of sublimation

ΔsubH (kJ/mol) Temperature (K) Method Reference Comment
143.5 ± 1.3355.MESwain and Karraker, 1970Based on data from 343. - 367. K.

References

Swain and Karraker, 1970
Swain, Howard A.; Karraker, David G., Volatile chelates of quadrivalent actinides, Inorg. Chem., 1970, 9, 7, 1766-1769, https://doi.org/10.1021/ic50089a032 . [all data]