Tetraethyleneglycol monomethylether

Phase change data

Data compiled by: Thermodynamics Research Center, NIST Boulder Laboratories, Chris Muzny director

Quantity Value Units Method Reference Comment
Tboil557.KN/ADavidson, 1926Uncertainty assigned by TRC = 3. K

In addition to the Thermodynamics Research Center (TRC) data available from this site, much more physical and chemical property data is available from the following TRC products:

Kovats' RI, non-polar column, isothermal

View large format table.

Column type Active phase Temperature (C) I Reference Comment
PackedApiezon L140.1413.Singliar and Dykyj, 1969
PackedApiezon L170.1416.Singliar and Dykyj, 1969

References

Davidson, 1926
Davidson, J.G., The glycol ethers and their use in the lacquer industry, Ind. Eng. Chem., 1926, 18, 669. [all data]