2,5,8,11,14-Pentaoxahexadecan-16-ol

Van Den Dool and Kratz RI, non-polar column, temperature ramp

View large format table.

Column type Active phase I Reference Comment
CapillaryUltra-21783.Poskrobko, Linkiewicz, et al., 199425. m/0.32 mm/0.52 μm, H2, 8. K/min; Tstart: 50. C; Tend: 310. C

Van Den Dool and Kratz RI, non-polar column, custom temperature program

View large format table.

Column type Active phase I Reference Comment
CapillaryVF-5MS1788.9Zheng and White, 200830. m/0.25 mm/0.25 μm, He; Program: not specified

References

Poskrobko, Linkiewicz, et al., 1994
Poskrobko, J.; Linkiewicz, M.; Jaworski, M., Analysis of high-boiling ethoxylates of methyl, ethyl and butyl alcohols, with the use of gas chromatography, Chem. Anal. (Warsaw), 1994, 39, 2, 153-159. [all data]

Zheng and White, 2008
Zheng, Y.; White, E., Retention Data. NIST Mass Spectrometry Data Center., NIST Mass Spectrometry Data Center, 2008. [all data]