Hexaborane

Gas phase ion energetics data

Data compiled as indicated in comments:
LLK - Sharon G. Lias, Rhoda D. Levin, and Sherif A. Kafafi
RDSH - Henry M. Rosenstock, Keith Draxl, Bruce W. Steiner, and John T. Herron

Ionization energy determinations

IE (eV) Method Reference Comment
9.0PEUlman and Fehlner, 1978LLK
9.3 ± 0.1EIFehlner and Koski, 1964RDSH
9.4PEUlman and Fehlner, 1978Vertical value; LLK

Appearance energy determinations

Ion AE (eV) Other Products MethodReferenceComment
B5H5+13.6 ± 0.2?EIFehlner and Koski, 1964RDSH
B5H7+12.0 ± 0.2BH3EIFehlner and Koski, 1964RDSH
B6H4+13.43H2EIFehlner and Koski, 1964RDSH
B6H5+12.02H2+HEIFehlner and Koski, 1964RDSH
B6H6+11.92H2EIFehlner and Koski, 1964RDSH
B6H7+11.5 ± 0.3H2+HEIFehlner and Koski, 1964RDSH
B6H8+11.2 ± 0.1H2EIFehlner and Koski, 1964RDSH
B6H9+11.1 ± 0.4HEIFehlner and Koski, 1964RDSH

References

Ulman and Fehlner, 1978
Ulman, J.A.; Fehlner, T.P., Ultraviolet photoelectron spectroscopy of boranes and carboranes. Five-, six-, and seven- atom frameworks, J. Am. Chem. Soc., 1978, 100, 449. [all data]

Fehlner and Koski, 1964
Fehlner, T.P.; Koski, W.S., The fragmentation of some boron hydrides by electron impact, J. Am. Chem. Soc., 1964, 86, 581. [all data]