Dibenzo[b,e]thiepin,6,11-dihydro-5,5-dioxide-

Gas phase ion energetics data

Data compiled by: Sharon G. Lias, Rhoda D. Levin, and Sherif A. Kafafi

Ionization energy determinations

IE (eV) Method Reference
9.85EISahini, Constantin, et al., 1978

Appearance energy determinations

Ion AE (eV) Other Products MethodReferenceComment
C14H10+10.00H2SO2EISahini, Constantin, et al., 1978
C14H11+10.35HSO2EISahini, Constantin, et al., 1978
C14H11OS+10.30OHEISahini, Constantin, et al., 1978
C14H12+10.20SO2EISahini, Constantin, et al., 1978

References

Sahini, Constantin, et al., 1978
Sahini, V.E.; Constantin, V.; Serban, I.; Vladescu, C., Electron-impact-induced fragmentation of some dibenzo[b,e]thiepines, Rev. Roum. Chim., 1978, 23, 315. [all data]