Cu(NH2)2

Gas phase ion energetics data

Data compiled by: John E. Bartmess

Electron affinity determinations

EA (eV) Method Reference Comment
1.480 ± 0.050LPESSobhy and Castleman, 2007Stated electron affinity is the Vertical Detachment Energy

References

Sobhy and Castleman, 2007
Sobhy, M.A.; Castleman, A.W., Photoelectron imaging of copper and silver mono- and diamine anions, J. Chem. Phys., 2007, 126, 15, 154314, https://doi.org/10.1063/1.2721566 . [all data]