1,3,5,7-Tetrathiocane

Gas phase ion energetics data

Data compiled as indicated in comments:
LLK - Sharon G. Lias, Rhoda D. Levin, and Sherif A. Kafafi

Ionization energy determinations

IE (eV) Method Reference Comment
7.8PEBock, Schulz, et al., 1981LLK
8.37PEBock, Schulz, et al., 1981Vertical value; LLK

Normal alkane RI, non-polar column, temperature ramp

View large format table.

Column type Active phase I Reference Comment
CapillarySPB-11518.Frerot, Velluz, et al., 200830. m/0.25 mm/1.0 μm, Helium, 60. C @ 5. min, 5. K/min; Tend: 250. C

References

Bock, Schulz, et al., 1981
Bock, H.; Schulz, W.; Schmidt, M., P. E. spektren und molekuleigenschaften. 89. Ionissationsmuster und konformation von Cyclo-Polythianen (H2CS)n, Z. Anorg. Allg. Chem., 1981, 474, 199. [all data]

Frerot, Velluz, et al., 2008
Frerot, E.; Velluz, A.; Bagnoud, A.; Delort, E., Analysis of the volatile constituents of cooked petai beans (Parkia speciosa) using high-resolution GC/TOF-MS, Flav. Fragr. J., 2008, 23, 6, 434-440, https://doi.org/10.1002/ffj.1902 . [all data]