2-Buten-1-one, 1-(2,6,6-trimethyl-1,3-cyclohexadien-1-yl)-, (E)-

Normal alkane RI, non-polar column, temperature ramp

Data compiled by: NIST Mass Spectrometry Data Center, William E. Wallace, director

Column type CapillaryCapillaryCapillaryCapillaryCapillary
Active phase Optima-5PTE-5HP-5 MSSE-54DB-5
Column length (m) 30.30.30.30.30.
Carrier gas HeliumHeliumHelium Nitrogen
Substrate
Column diameter (mm) 0.250.250.250.320.25
Phase thickness (μm) 0.250.250.250.250.25
Tstart (C) 60.80.70.0.40.
Tend (C) 246.300.200.200.230.
Heat rate (K/min) 3.7.3.6.2.
Initial hold (min) 1.3.2.2.
Final hold (min)  5.18.
I 1384.1385.1388.1389.1385.
ReferenceAl-Qudah, Muhaidat, et al., 2012Fabri, Coimbra, et al., 2012Jerkovic, Hegic, et al., 2010Laselan, Buettner, et al., 2009Scrivanti, Anton, et al., 2009
Comment MSDC-RI MSDC-RI MSDC-RI MSDC-RI MSDC-RI
Column type CapillaryCapillaryCapillaryCapillaryCapillary
Active phase HP-5 MSDB-1HP-5SLB-5MSHP-5
Column length (m) 30.30.30.10.30.
Carrier gas HeliumHeHeliumHeliumHe
Substrate
Column diameter (mm) 0.250.250.320.180.25
Phase thickness (μm) 0.250.250.250.18
Tstart (C) 50.30.100.40.70.
Tend (C) 280.210.240.295.240.
Heat rate (K/min) 4.5.5.10.5.
Initial hold (min)   2.1.5
Final hold (min)   5.
I 1386.1373.1380.1384.1389.
ReferenceZhao, Zeng, et al., 2009Kumazawa, Itobe, et al., 2008Lago, Romoff, et al., 2008Risticevic, Carasek, et al., 2008Asekun, Olusegun, et al., 2007
Comment MSDC-RI MSDC-RI MSDC-RI MSDC-RI MSDC-RI
Column type CapillaryCapillaryCapillaryCapillaryCapillary
Active phase HP-5MSHP-5MSDB-5ZB-5DB-5
Column length (m) 30.30.30.30.30.
Carrier gas HeHeHe Helium
Substrate
Column diameter (mm) 0.250.250.250.250.25
Phase thickness (μm) 0.250.250.250.250.25
Tstart (C) 60.60.40.60.60.
Tend (C) 280.250.240.220.220.
Heat rate (K/min) 3.2.3.4.4.
Initial hold (min)  8. 5.
Final hold (min)  15. 20.
I 1367.1379.1378.1378.1386.
ReferenceBasta, Tzakou, et al., 2007Ferhat, Tigrine-Kordjani, et al., 2007Machado, Bastos, et al., 2007Mohottalage, Tabacchi, et al., 2007Morteza-Semnani, Saeedi, et al., 2007
Comment MSDC-RI MSDC-RI MSDC-RI MSDC-RI MSDC-RI
Column type CapillaryCapillaryCapillaryCapillaryCapillary
Active phase RTX-5DB-5DB-1HP-101HP-5
Column length (m) 10.60.60.25.30.
Carrier gas HeHe HeHelium
Substrate
Column diameter (mm) 0.180.320.250.20.32
Phase thickness (μm) 0.2 0.250.20.25
Tstart (C) 40.60.60.70.40.
Tend (C) 275.250.250.200.240.
Heat rate (K/min) 50.4.5.3.4.
Initial hold (min) 0.55. 2.
Final hold (min) 0.5 10.15.5.
I 1394.1375.1368.1364.1373.
ReferenceSetkova, Risticevic, et al., 2007Fadel, Mageed, et al., 2006Hadian, Sonboli, et al., 2006Mastelic, Jerkovic, et al., 2006Miyazawa and Kawata, 2006
Comment MSDC-RI MSDC-RI MSDC-RI MSDC-RI MSDC-RI
Column type CapillaryCapillaryCapillaryCapillaryCapillary
Active phase DB-5DB-5DB-5HP-5 MSHP-5MS
Column length (m) 30.30.13.530.30.
Carrier gas HeHeHeHeliumHe
Substrate
Column diameter (mm) 0.250.250.320.250.25
Phase thickness (μm) 0.250.25 0.250.25
Tstart (C) 60.40.35.60.60.
Tend (C) 220.260.225.250.280.
Heat rate (K/min) 4.2.6.2.3.
Initial hold (min)  5.3.8.
Final hold (min)  20. 15.
I 1387.1382.1383.1379.1359.
ReferenceMorteza-Semnani, Akbarzadeh, et al., 2006Senatore, Landolfi, et al., 2006de Souza, Vásquez, et al., 2006Tigrine-Kordiani, Meklati, et al., 2006Tzakou, Said, et al., 2006
Comment MSDC-RI MSDC-RI MSDC-RI MSDC-RI MSDC-RI
Column type CapillaryCapillaryCapillaryCapillaryCapillary
Active phase HP-5HP-5HP-5HP-5MSHP-1
Column length (m) 30.30.30.30.50.
Carrier gas HeHeHeHeHe
Substrate
Column diameter (mm) 0.250.320.320.250.2
Phase thickness (μm) 0.250.250.250.250.5
Tstart (C) 60.60.60.60.60.
Tend (C) 250.260.260.280.250.
Heat rate (K/min) 10.5.5.3.2.
Initial hold (min) 2.2.2.
Final hold (min) 10.14.14. 60.
I 1394.1380.1385.1360.1361.
ReferenceWang, Yang, et al., 2006Yayli, Gülec, et al., 2006Yayli, Gülec, et al., 2006Basta, Tzakou, et al., 2005Bendimerad and Bendiab, 2005
Comment MSDC-RI MSDC-RI MSDC-RI MSDC-RI MSDC-RI
Column type CapillaryCapillaryCapillaryCapillaryCapillary
Active phase SPB-5HP-5DB-5DB-5DB-1
Column length (m) 30.60.30.30.50.
Carrier gas HeHeHeHeN2
Substrate
Column diameter (mm) 0.530.320.250.250.25
Phase thickness (μm)  0.250.250.250.25
Tstart (C) 100.30.60.60.95.
Tend (C) 250.260.220.220.240.
Heat rate (K/min) 5.2.4.4.4.
Initial hold (min)  2.5.4.
Final hold (min)  28.
I 1402.1390.91385.1387.1371.
ReferenceKilic, Kollmannsberger, et al., 2005Leffingwell and Alford, 2005Morteza-Semnani, Akbarzadeh, et al., 2005Morteza-Semnani and Saeedi, 2005Pala-Paul, Perez-Alonso, et al., 2005
Comment MSDC-RI MSDC-RI MSDC-RI MSDC-RI MSDC-RI
Column type CapillaryCapillaryCapillaryCapillaryCapillary
Active phase DB-5HP-5HP-5MSHP-5MSDB-1
Column length (m) 30.30.30.30.30.
Carrier gas HeHeHeHeHe
Substrate
Column diameter (mm) 0.250.320.250.250.25
Phase thickness (μm) 0.250.250.250.250.25
Tstart (C) 40.60.60.60.50.
Tend (C) 260.260.280.280.265.
Heat rate (K/min) 2.5.3.3.2.5
Initial hold (min) 5.2.  1.
Final hold (min) 20.13.  20.
I 1382.1385.1383.1381.1351.
ReferenceSenatore, Apostolides Arnold, et al., 2005Yayli, Yasar, et al., 2005Malencic, Couladis, et al., 2004Mimica-Dukic, Bozin, et al., 2004Sarkhail, Amin, et al., 2004
Comment MSDC-RI MSDC-RI MSDC-RI MSDC-RI MSDC-RI
Column type CapillaryCapillaryCapillaryCapillaryCapillary
Active phase SE-54SPB-5OV-101HP-1DB-5
Column length (m) 30.30.12.50.30.
Carrier gas N2He HeHe
Substrate
Column diameter (mm) 0.250.320.320.20.25
Phase thickness (μm) 0.250.250.320.50.25
Tstart (C) 40.40.35.60.60.
Tend (C) 200.220.225.220.240.
Heat rate (K/min) 5.5.6.2.3.
Initial hold (min) 4.1.3.
Final hold (min) 10.20. 40.
I 1380.1386.1361.1358.1382.
ReferenceTura, Prenzler, et al., 2004Ledauphin, Guichard, et al., 2003Murakami, Goldstein, et al., 2003Valette, Fernandez, et al., 2003Flamini, Ertugrul, et al., 2002
Comment MSDC-RI MSDC-RI MSDC-RI MSDC-RI MSDC-RI
Column type CapillaryCapillaryCapillaryCapillaryCapillary
Active phase DB-5DB-5DB-5Optima-1DB-5MS
Column length (m) 30.30.30.25.30.
Carrier gas HeHeHeHeHe
Substrate
Column diameter (mm) 0.250.320.320.200.53
Phase thickness (μm) 0.250.250.250.251.5
Tstart (C) 60.40.40.50.40.
Tend (C) 240.290.230.250.225.
Heat rate (K/min) 3.7.6.3.6.
Initial hold (min)   2.3.5.
Final hold (min)   5. 30.
I 1381.1390.1395.1363.1396.
ReferenceKobaisy, Tellez, et al., 2002Lin, Rouseff, et al., 2002Sanz, Czerny, et al., 2002Brun, Bessière, et al., 2001Cadwallader and Heo, 2001
Comment MSDC-RI MSDC-RI MSDC-RI MSDC-RI MSDC-RI
Column type CapillaryCapillaryCapillaryCapillaryCapillary
Active phase HP-5DB-5MSDB-5MSDB-5DB-5
Column length (m) 30.60.30.30.30.
Carrier gas N2HeHeH2He
Substrate
Column diameter (mm) 0.250.250.320.320.25
Phase thickness (μm) 0.250.250.250.50.25
Tstart (C) 60.40.40.60.60.
Tend (C) 220.200.195.245.240.
Heat rate (K/min) 5.2.5.3.3.
Initial hold (min) 10.5.5.3.
Final hold (min)  30.40.20.
I 1381.1384.1391.1395.1383.
ReferenceCampeol, Flamini, et al., 2001Lee, Suriyaphan, et al., 2001Suriyaphan, Drake, et al., 2001Kotseridis and Baumes, 2000Tellez, Dayan, et al., 2000
Comment MSDC-RI MSDC-RI MSDC-RI MSDC-RI MSDC-RI
Column type CapillaryCapillaryCapillaryCapillaryCapillary
Active phase BP-5HP-1OV-101HP-1HP-1
Column length (m) 50.25.10.25.25.
Carrier gas He Helium
Substrate
Column diameter (mm) 0.320.200.250.320.32
Phase thickness (μm) 1. 0.52
Tstart (C) 40.35.35.35.35.
Tend (C) 190.250.225.250.250.
Heat rate (K/min) 2.4.6.4.4.
Initial hold (min) 5. 3.
Final hold (min)
I 1393.1356.1349.1356.1356.
ReferenceLopez, Ferreira, et al., 1999Ong and Acree, 1999Deibler, Acree, et al., 1998Ong and Acree, 1998Ong, Acree, et al., 1998
Comment MSDC-RI MSDC-RI MSDC-RI MSDC-RI MSDC-RI
Column type CapillaryCapillaryCapillaryCapillaryCapillary
Active phase OV-101OV-101OV-101OV-101DB-5
Column length (m) 12.12.15.15.30.
Carrier gas   HeHeH2
Substrate
Column diameter (mm) 0.320.320.320.320.32
Phase thickness (μm)     1.
Tstart (C) 35.35.35.35.40.
Tend (C) 225.225.250.250.220.
Heat rate (K/min) 6.6.6.6.3.
Initial hold (min) 3.3.3.3.
Final hold (min)
I 1352.1353.1356.1360.1390.
ReferenceRoberts and Acree, 1996Roberts and Acree, 1996Chisholm, Guiher, et al., 1995Chisholm, Guiher, et al., 1995Moio, Dekimpe, et al., 1993
Comment MSDC-RI MSDC-RI MSDC-RI MSDC-RI MSDC-RI
Column type PackedCapillaryCapillaryCapillaryCapillary
Active phase SE-54DB-1DB-1DB-1HP-5
Column length (m) 3.60.60.60.50.
Carrier gas    HeH2
Substrate Chromosorb G AW DMCS (100-120 mesh)
Column diameter (mm)  0.32 0.250.3
Phase thickness (μm)
Tstart (C) 50.50.30.30.80.
Tend (C) 230.230.200.200.250.
Heat rate (K/min) 6.4.4.4.16.
Initial hold (min) 2. 25.25.
Final hold (min) 10.10.30.5.
I 1389.1360.1360.1360.1371.
ReferenceSchieberle, 1991Binder, Turner, et al., 1990Buttery, Takeoka, et al., 1990Buttery, Teranishi, et al., 1990Spadone, Takeoka, et al., 1990
Comment MSDC-RI MSDC-RI MSDC-RI MSDC-RI MSDC-RI
Column type CapillaryCapillaryCapillaryCapillaryCapillary
Active phase HP-5OV-101OV-101DB-5DB-1
Column length (m) 50.50.50.30.50.
Carrier gas H2N2N2Hydrogen
Substrate
Column diameter (mm) 0.30.250.250.350.32
Phase thickness (μm)    1.0
Tstart (C) 80.80.80.45.0.
Tend (C) 250.200.200.220.250.
Heat rate (K/min) 16.2.2.2.3.
Initial hold (min)
Final hold (min)
I 1397.1360.1367.1396.1360.
ReferenceSpadone, Takeoka, et al., 1990Yang and Sugisawa, 1990Yang and Sugisawa, 1990Georgilopoulos and Gallois, 1988Habu, Flath, et al., 1985
Comment MSDC-RI MSDC-RI MSDC-RI MSDC-RI MSDC-RI
Column type Capillary
Active phase DB-1
Column length (m) 50.
Carrier gas
Substrate
Column diameter (mm) 0.32
Phase thickness (μm)
Tstart (C) 50.
Tend (C) 250.
Heat rate (K/min) 3.
Initial hold (min)
Final hold (min)
I 1360.
ReferenceHabu, Flath, et al., 1985
Comment MSDC-RI

Kovats' RI, non-polar column, isothermal

Data compiled by: NIST Mass Spectrometry Data Center, William E. Wallace, director

Column type CapillaryCapillaryCapillaryCapillary
Active phase SPB-1SPB-1SPB-1SPB-1
Column length (m) 37.37.37.37.
Carrier gas HeHeHeHe
Substrate
Column diameter (mm) 0.320.320.320.32
Phase thickness (μm) 0.250.250.250.25
Temperature (C) 132.143.152.162.
I 1366.1371.1375.1377.
ReferenceMisharina, Samusenko, et al., 2002Misharina, Samusenko, et al., 2002Misharina, Samusenko, et al., 2002Misharina, Samusenko, et al., 2002
Comment MSDC-RI MSDC-RI MSDC-RI MSDC-RI

Kovats' RI, polar column, temperature ramp

Data compiled by: NIST Mass Spectrometry Data Center, William E. Wallace, director

Column type CapillaryCapillaryCapillaryCapillary
Active phase SupelcowaxSupelcowaxCarbowax 20MCarbowax 20M
Column length (m) 30.30.50.50.
Carrier gas   HeHe
Substrate
Column diameter (mm) 0.250.250.280.28
Phase thickness (μm) 0.250.25
Tstart (C) 60.60.70.70.
Tend (C) 240.240.190.190.
Heat rate (K/min) 3.3.2.2.
Initial hold (min) 5.5.
Final hold (min) 10.10.
I 1806.1806.1801.1801.
ReferenceRiu-Aumatell, Castellari, et al., 2004Riu-Aumatell, Castellari, et al., 2004Tressl, Friese, et al., 1978Tressl, Friese, et al., 1978, 2
Comment MSDC-RI MSDC-RI MSDC-RI MSDC-RI

References

Al-Qudah, Muhaidat, et al., 2012
Al-Qudah, M.A.; Muhaidat, R.; Trawenh, I.N.; Jaber, H.I.; Abu Zarga, M.H.; Abu Orabi, S.T., Volatile constituents of leaves and bulbs of Gynandriris Sisyrinchicum and their antimicrobial activities, Jordan J. Chem., 2012, 7, 3, 287-295. [all data]

Fabri, Coimbra, et al., 2012
Fabri, R.F.; Coimbra, E.; Almeida, A.C.; Siqueira, E.P.; Alves, T.M.A.; Zani, C.L.; Scio, E., Essential oil of Mitracarpus frigidus as a potent sourse of bioactive compounds, Annals of the Brazilian Academy of Sciences, 2012, 84, 4, 1073-1080, https://doi.org/10.1590/S0001-37652012000400021 . [all data]

Jerkovic, Hegic, et al., 2010
Jerkovic, I.; Hegic, G.; Marijanovic, Z.; Bubalo, D., Organic extractives from Mentha spp. honey and the bee-stomach: methyl syringate, vomifoliol, terpenediol I, hotrienol, and other compounds, Molecules, 2010, 15, 4, 2911-2924, https://doi.org/10.3390/molecules15042911 . [all data]

Laselan, Buettner, et al., 2009
Laselan, P.; Buettner, A.; Christlbauer, M., Investigation of the retronasal perseption of palm wine (Elaeis guineensis) aroma by application of sensory analysis and exhaled odorant measurement (EXOM), African J. of Food, Agriculture, Nutrition and development, 2009, 9, 2, 793-813. [all data]

Scrivanti, Anton, et al., 2009
Scrivanti, L.R.; Anton, A.M.; Zygadlo, J.A., Essential oil conposition of Bothriochloa Kuntze (Poaceae) from South America and their chemotaxonomy, Biochem. Systematics Ecol., 2009, 37, 3, 206-213, https://doi.org/10.1016/j.bse.2009.03.009 . [all data]

Zhao, Zeng, et al., 2009
Zhao, C.; Zeng, Y.; Wan, M.; Li, R.; Liang, Y.; Li, C.; Zeng, Z.; Chau, F.-T., Comparative analysis of essential oils from eight herbal medicines with pungent flavor and cool nature by GC-MS and chemometric resolution methods, J. Sep. Sci., 2009, 32, 4, 660-670, https://doi.org/10.1002/jssc.200800484 . [all data]

Kumazawa, Itobe, et al., 2008
Kumazawa, K.; Itobe, T.; Nishimura, O.; Hamaguchi, T., A new approach to estimate the in-mouth release characteristics of odorants in chewing gum, Food Science and Technology Research, 2008, 14, 3, 269-276, https://doi.org/10.3136/fstr.14.269 . [all data]

Lago, Romoff, et al., 2008
Lago, J.H.G.; Romoff, P.; Favero, O.A.; Souza, F.O.; Soares, M.G.; Baraldi, P.T.; Correa, A.G., Chemical composition of male and female Baccharis trimera (Less.) DC. (Asteraceae) essential oils, Biochem. Systematics Ecol., 2008, 36, 9, 737-740, https://doi.org/10.1016/j.bse.2008.05.009 . [all data]

Risticevic, Carasek, et al., 2008
Risticevic, S.; Carasek, E.; Pawliszyn, J., Headspace solid-phase microextraction-gas chromatographic-time-of-flight mass spectrometric methodology for geographical origin verification of coffee, Anal. Chim. Acta, 2008, 617, 1-2, 72-84, https://doi.org/10.1016/j.aca.2008.04.009 . [all data]

Asekun, Olusegun, et al., 2007
Asekun, O.T.; Olusegun, E.; Adebola, O., The volatile constituents of the leaves and flowers of Kigelia africana Benth., Flavour Fragr. J., 2007, 22, 1, 21-23, https://doi.org/10.1002/ffj.1723 . [all data]

Basta, Tzakou, et al., 2007
Basta, A.; Tzakou, O.; Couladis, M.; Yannitsaros, A., Essential oil composition of Prasium majus L. from Greece, Flavour Fragr. J., 2007, 22, 5, 347-349, https://doi.org/10.1002/ffj.1802 . [all data]

Ferhat, Tigrine-Kordjani, et al., 2007
Ferhat, M.A.; Tigrine-Kordjani, N.; Chemat, S.; Meklati, B.Y.; Chemat, F., Rapid Extraction of Volatile Compounds Using a New Simultaneous Microwave Distillation: Solvent Extraction Device, Chromatographia, 2007, 65, 3-4, 217-222, https://doi.org/10.1365/s10337-006-0130-5 . [all data]

Machado, Bastos, et al., 2007
Machado, C.C.B.; Bastos, D.H.M.; Janzantti, N.S.; Facanali, R.; Marques, M.M.; Franco, M.R.B., Determinação do perfil de compostos voláteis e avaliação do sabor e aroma de bebidas produzidas a partir da erva-mate (Ilex paraguariensis), Quim. Nova, 2007, 30, 3, 513-518, https://doi.org/10.1590/S0100-40422007000300002 . [all data]

Mohottalage, Tabacchi, et al., 2007
Mohottalage, S.; Tabacchi, R.; Guerin, P.M., Components from Sri Lankan Piper betle L. leaf oil and their analogues showing toxicity against the housefly, Musca domestica, Flavour Fragr. J., 2007, 22, 2, 130-138, https://doi.org/10.1002/ffj.1770 . [all data]

Morteza-Semnani, Saeedi, et al., 2007
Morteza-Semnani, K.; Saeedi, M.; Akbarzadeh, M., Essential oil composition of Teucrium scordium L., Acta Pharm., 2007, 57, 4, 499-504, https://doi.org/10.2478/v10007-007-0040-6 . [all data]

Setkova, Risticevic, et al., 2007
Setkova, L.; Risticevic, S.; Pawliszyn, J., Rapid headspace solid-phase microextraction-gas chromatographic?time-of-flight mass spectrometric method for qualitative profiling of ice wine volatile fraction II: Classification of Canadian and Czech ice wines using statistical evaluation of the data, J. Chromatogr. A, 2007, 1147, 2, 224-240, https://doi.org/10.1016/j.chroma.2007.02.052 . [all data]

Fadel, Mageed, et al., 2006
Fadel, H.H.M.; Mageed, M.A.A.; Lotfy, S.N., Quality and flavour stability of coffee substitute prepared by extrusion of wheat germ and chicory roots, Amino Acids, 2006, https://doi.org/10.1007/s007260200008 . [all data]

Hadian, Sonboli, et al., 2006
Hadian, J.; Sonboli, A.; Ebrahimi, S.N.; Mirjalili, M.H., Essential oil composition of Nepeta satureioides from Iran, Chem. Nat. Compd. (Engl. Transl.), 2006, 42, 2, 175-177, https://doi.org/10.1007/s10600-006-0071-0 . [all data]

Mastelic, Jerkovic, et al., 2006
Mastelic, J.; Jerkovic, I.; Mesic, M., Volatile constituents from flowers, leaves, bark and wood of Prunus mahaleb L., Flavour Fragr. J., 2006, 21, 2, 306-313, https://doi.org/10.1002/ffj.1596 . [all data]

Miyazawa and Kawata, 2006
Miyazawa, M.; Kawata, J., Identification of the Key Aroma Compounds in Dried Roots of Rubia cordifolia, L. Oleo Sci., 2006, 55, 1, 37-39, https://doi.org/10.5650/jos.55.37 . [all data]

Morteza-Semnani, Akbarzadeh, et al., 2006
Morteza-Semnani, K.; Akbarzadeh, M.; Changizi, S., Essential oils composition of Stachys byzantina, S. inflata, S. lavandulifolia and S. laxa from Iran, Flavour Fragr. J., 2006, 21, 2, 300-303, https://doi.org/10.1002/ffj.1594 . [all data]

Senatore, Landolfi, et al., 2006
Senatore, F.; Landolfi, S.; Celik, S.; Bruno, M., Volatile components of Centaurea calcitrapa L. and Centaurea sphaerocephala L. ssp. sphaerocephala, two Asteraceae growing wild in Sicily, Flavour Fragr. J., 2006, 21, 2, 282-285, https://doi.org/10.1002/ffj.1585 . [all data]

de Souza, Vásquez, et al., 2006
de Souza, M.D.C.A.; Vásquez, P.; del Mastro, N.L.; Acree, T.E.; Lavin, E.H., Characterization and cachaca and rum aroma, J. Agric. Food Chem., 2006, 54, 2, 485-488, https://doi.org/10.1021/jf0511190 . [all data]

Tigrine-Kordiani, Meklati, et al., 2006
Tigrine-Kordiani, N.; Meklati, B.Y.; Chemat, F., Abalysis by gas chromatography - mass spectrometry of the essential oil of Zygophyllum album L., an aromatic and medicinal plant growing in Algeria, Int. J. Aromatherapy, 2006, 16, 3-4, 187-191, https://doi.org/10.1016/j.ijat.2006.09.008 . [all data]

Tzakou, Said, et al., 2006
Tzakou, O.; Said, A.; Farag, A.; Rashed, K., Volatile constituents of Ailanthus excelsa Roxb., Flavour Fragr. J., 2006, 21, 6, 899-901, https://doi.org/10.1002/ffj.1739 . [all data]

Wang, Yang, et al., 2006
Wang, Q.; Yang, Y.; Zhao, X.; Zhu, B.; Nan, P.; Zhao, J.; Wang, L.; Chen, F.; Liu, Z.; Zhong, Y., Chemical variation in the essential oil of Ephedra sinica from Northeastern China, Food Chem., 2006, 98, 1, 52-58, https://doi.org/10.1016/j.foodchem.2005.04.033 . [all data]

Yayli, Gülec, et al., 2006
Yayli, N.; Gülec, C.; Ücüncü, O.; Yasar, A.; Ülker, S.; Coskuncelebi, K.; Terzioglu, S., Composition and Antimicrobial Activities of Volatile Components of Minuartia meyeri, Turk. J. Chem., 2006, 30, 71-76. [all data]

Basta, Tzakou, et al., 2005
Basta, A.; Tzakou, O.; Couladis, M., Composition of the leaves essential oil of Melissa officinalis s. l. from Greece, Flavour Fragr. J., 2005, 20, 6, 642-644, https://doi.org/10.1002/ffj.1518 . [all data]

Bendimerad and Bendiab, 2005
Bendimerad, N.; Bendiab, S.A.T., Composition and antibacterial activity of Pseudocytisus integrifolius (Salisb.) essential oil from Algeria, J. Agric. Food Chem., 2005, 53, 8, 2947-2952, https://doi.org/10.1021/jf047937u . [all data]

Kilic, Kollmannsberger, et al., 2005
Kilic, A.; Kollmannsberger, H.; Nitz, S., Glycosidically bound volatiles and flavor precursors in Laurus nobilis L., J. Agric. Food Chem., 2005, 53, 6, 2231-2235, https://doi.org/10.1021/jf040373+ . [all data]

Leffingwell and Alford, 2005
Leffingwell, J.C.; Alford, E.D., Volatile constituents of Perique tobacco, Electron. J. Environ. Agric. Food Chem., 2005, 4, 2, 899-915. [all data]

Morteza-Semnani, Akbarzadeh, et al., 2005
Morteza-Semnani, K.; Akbarzadeh, M.; Rostami, B., The essential oil composition of Teucrium chamaedrys L. from Iran, Flavour Fragr. J., 2005, 20, 5, 544-546, https://doi.org/10.1002/ffj.1479 . [all data]

Morteza-Semnani and Saeedi, 2005
Morteza-Semnani, K.; Saeedi, M., The essential oil composition of Phlomis bruguieri Desf. from Iran, Flavour Fragr. J., 2005, 20, 3, 344-346, https://doi.org/10.1002/ffj.1459 . [all data]

Pala-Paul, Perez-Alonso, et al., 2005
Pala-Paul, J.; Perez-Alonso, M.J.; Velasco-Negueruela, A.; Vadare, J.; Villa, A.M.; Sanz, J.; Brophy, J.J., Essential oil composition of the different parts of Eryngium bourgatii Gouan from Spain, J. Chromatogr. A, 2005, 1074, 1-2, 235-239, https://doi.org/10.1016/j.chroma.2005.03.036 . [all data]

Senatore, Apostolides Arnold, et al., 2005
Senatore, F.; Apostolides Arnold, N.; Bruno, M., Volatile components of Centaurea eryngioides Lam. and Centaurea liberica Trev. var. hermonis Boiss. Lam., two Asteraceae growing wild in Lebanon, Nat. Prod. Res., 2005, 19, 8, 749-754, https://doi.org/10.1080/14786410412331302136 . [all data]

Yayli, Yasar, et al., 2005
Yayli, N.; Yasar, A.; Gülec, C.; Usta, A.; Kolayli, S.; Coskuncelebi, K.; Karaoglu, S., Composition and antimicrobial activity of essential oils from Centaurea sessilis and Centaurea armena, Phytochemistry, 2005, 66, 14, 1741-1745, https://doi.org/10.1016/j.phytochem.2005.04.006 . [all data]

Malencic, Couladis, et al., 2004
Malencic, Dj.; Couladis, M.; Mimica-Dukic, N.; Popovic, M.; Boza, P., Essential oils of three Salvia species from the Pannonian part of Serbia, Flavour Fragr. J., 2004, 19, 3, 225-228, https://doi.org/10.1002/ffj.1291 . [all data]

Mimica-Dukic, Bozin, et al., 2004
Mimica-Dukic, N.; Bozin, B.; Sokovic, M.; Simin, N., Antimicrobial and antioxidant activities of Melissa officinalis L. (Lamiaceae) essential oil, J. Agric. Food Chem., 2004, 52, 9, 2485-2489, https://doi.org/10.1021/jf030698a . [all data]

Sarkhail, Amin, et al., 2004
Sarkhail, P.; Amin, G.; Shafiee, A., Composition of the essential oil of Phlomis persica Boiss and Phlomis chorassanica Bunge from Iran, Flavour Fragr. J., 2004, 19, 6, 538-540, https://doi.org/10.1002/ffj.1338 . [all data]

Tura, Prenzler, et al., 2004
Tura, D.; Prenzler, P.D.; Bedgood, D.R., Jr.; Antolovich, M.; Robards, K., Varietal and processing effects on the volatile profile of Australian olive oils, Food Chem., 2004, 84, 3, 341-349, https://doi.org/10.1016/S0308-8146(03)00217-6 . [all data]

Ledauphin, Guichard, et al., 2003
Ledauphin, J.; Guichard, H.; Saint-Clair, J.-F.; Picoche, B.; Barillier, D., Chemical and sensorial aroma characterization of freshly distilled calvados. 2. Identification of volatile compounds and key odorants, J. Agric. Food Chem., 2003, 51, 2, 433-442, https://doi.org/10.1021/jf020373e . [all data]

Murakami, Goldstein, et al., 2003
Murakami, A.A.; Goldstein, H.; Navarro, A.; Seabrooks, J.R.; Ryder, D.S., Investigation of beer flavor by gas chromatography-olfactometry, J. Am. Soc. Brew. Chem., 2003, 61, 1, 23-32, retrieved from http://www.asbcnet.org/Journal/samplepdfs/0127-01R.pdf. [all data]

Valette, Fernandez, et al., 2003
Valette, L.; Fernandez, X.; Poulain, S.; Loiseau, A.-M.; Lizzani-Cuvelier, L.; Levieil, R.; Restier, L., Volatile constituents from Romanesco cauliflower, Food Chem., 2003, 80, 3, 353-358, https://doi.org/10.1016/S0308-8146(02)00272-8 . [all data]

Flamini, Ertugrul, et al., 2002
Flamini, G.; Ertugrul, K.; Cioni, P.L.; Morelli, I.; Dural, H.; Bagci, Y., Volatile constituents of two endemic Centaurea species from Turkey: C. pseudoscabiosa subsp. pseudoscabiosa and C. hadimensis, Biochem. Syst. Ecol., 2002, 30, 10, 953-959, https://doi.org/10.1016/S0305-1978(02)00043-1 . [all data]

Kobaisy, Tellez, et al., 2002
Kobaisy, M.; Tellez, M.R.; Dayan, F.E.; Duke, S.O., Phytotoxicity and volatile constituents from leaves of Callicarpa japonica Thunb., Phytochemistry, 2002, 61, 1, 37-40, https://doi.org/10.1016/S0031-9422(02)00207-8 . [all data]

Lin, Rouseff, et al., 2002
Lin, J.; Rouseff, R.L.; Barros, S.; Naim, M., Aroma composition changes in early season grapefruit juice produced from thermal concentration, J. Agric. Food Chem., 2002, 50, 4, 813-819, https://doi.org/10.1021/jf011154g . [all data]

Sanz, Czerny, et al., 2002
Sanz, C.; Czerny, M.; Cid, C.; Schieberle, P., Comparison of potent odorants in a filtered coffee brew and in an instant coffee beverage by aroma extract dilution analysis (AEDA), Eur. Food Res. Technol., 2002, 214, 4, 299-302, https://doi.org/10.1007/s00217-001-0459-9 . [all data]

Brun, Bessière, et al., 2001
Brun, G.; Bessière, J.-M.; Dijoux-Franca, M.-G.; David, B.; Mariotte, A.-M., Volatile components of Catharanthus roseus (L.) G. Don (Apocynaceae), Flavour Fragr. J., 2001, 16, 2, 116-119, https://doi.org/10.1002/ffj.958 . [all data]

Cadwallader and Heo, 2001
Cadwallader, K.R.; Heo, J., Aroma of roasted sesame oil: characterization by direct thermal desorption-gas chromatography-olfactometry and sample dilution analysis, Am. Chem. Soc. Symp. Ser., 2001, 782, 187-202. [all data]

Campeol, Flamini, et al., 2001
Campeol, E.; Flamini, G.; Chericoni, S.; Catalano, S.; Cremonini, R., Volatile compounds from three cultivars of Olea europaea from Italy, J. Agric. Food Chem., 2001, 49, 11, 5409-5411, https://doi.org/10.1021/jf010455n . [all data]

Lee, Suriyaphan, et al., 2001
Lee, G.-H.; Suriyaphan, O.; Cadwallader, K.R., Aroma components of cooked tail meat of American lobster (Homarus americanus), J. Agric. Food Chem., 2001, 49, 9, 4324-4332, https://doi.org/10.1021/jf001523t . [all data]

Suriyaphan, Drake, et al., 2001
Suriyaphan, O.; Drake, M.; Chen, X.Q.; Cadwallader, K.R., Characteristic aroma components of British farmhouse cheddar cheese, J. Agric. Food Chem., 2001, 49, 3, 1382-1387, https://doi.org/10.1021/jf001121l . [all data]

Kotseridis and Baumes, 2000
Kotseridis, Y.; Baumes, R., Identification of impact odorants in Bordeaux red grape juice, in the commercial yeast used for its fermentation, and in the produced wine, J. Agric. Food Chem., 2000, 48, 2, 400-406, https://doi.org/10.1021/jf990565i . [all data]

Tellez, Dayan, et al., 2000
Tellez, M.R.; Dayan, F.E.; Schrader, K.K.; Wedge, D.E.; Duke, S.O., Composition and some biological activities of the essential oils of Callicarpa Americana (L.), J. Agric. Food Chem., 2000, 48, 7, 3008-3012, https://doi.org/10.1021/jf991026g . [all data]

Lopez, Ferreira, et al., 1999
Lopez, R.; Ferreira, V.; Hernandez, P.; Cacho, J.F., Identification of impact odorants of young red wines made with Merlot, Cabernet Sauvignon and Grenache grape varieties: a comparative study, J. Sci. Food Agric., 1999, 79, 11, 1461-1467, https://doi.org/10.1002/(SICI)1097-0010(199908)79:11<1461::AID-JSFA388>3.0.CO;2-K . [all data]

Ong and Acree, 1999
Ong, P.K.C.; Acree, T.E., Similarities in the aroma chemistry of Gewürztraminer variety wines and lychee (Litchi chinesis Sonn.) fruit, J. Agric. Food Chem., 1999, 47, 2, 665-670, https://doi.org/10.1021/jf980452j . [all data]

Deibler, Acree, et al., 1998
Deibler, K.D.; Acree, T.E.; Lavin, E.H., Aroma analysis of coffrr brew by gas chromatography-oldfactometry, Developments in Food Sci., 1998, 40, 69-78. [all data]

Ong and Acree, 1998
Ong, P.K.C.; Acree, T.E., Gas chromatography/olfactory analysis of lychee (Litchi chinesis Sonn.), J. Agric. Food Chem., 1998, 46, 6, 2282-2286, https://doi.org/10.1021/jf9801318 . [all data]

Ong, Acree, et al., 1998
Ong, P.K.C.; Acree, T.E.; Lavin, E.H., Characterization of volatiles in rambutan fruit (Nephelium lappaceum L.), J. Agric. Food Chem., 1998, 46, 2, 611-615, https://doi.org/10.1021/jf970665t . [all data]

Roberts and Acree, 1996
Roberts, D.D.; Acree, T.E., Effects of heating and cream addition on fresh raspberry aroma using a retronasal aroma simulator and gas chromatography olfactometry, J. Agric. Food Chem., 1996, 44, 12, 3919-3925, https://doi.org/10.1021/jf950701t . [all data]

Chisholm, Guiher, et al., 1995
Chisholm, M.G.; Guiher, L.A.; Zaczkiewicz, S.M., Aroma characteristics of aged Vidal blanc wine, Am. J. Enol. Vitic, 1995, 46, 1, 56-62. [all data]

Moio, Dekimpe, et al., 1993
Moio, L.; Dekimpe, J.; Etievant, P.; Addeo, F., Neutral volatile compounds in the raw milks from different species, J. Dairy Res., 1993, 60, 2, 199-213, https://doi.org/10.1017/S0022029900027515 . [all data]

Schieberle, 1991
Schieberle, P., Primary odorants in popcorn, J. Agric. Food Chem., 1991, 39, 6, 1141-1144, https://doi.org/10.1021/jf00006a030 . [all data]

Binder, Turner, et al., 1990
Binder, R.G.; Turner, C.E.; Flath, R.A., Comparison of yellow starthistle volatiles from different plant parts, J. Agric. Food Chem., 1990, 38, 3, 764-767, https://doi.org/10.1021/jf00093a038 . [all data]

Buttery, Takeoka, et al., 1990
Buttery, R.G.; Takeoka, G.; Teranishi, R.; Ling, L.C., Tomato aroma components: identification of glycoside hydrolysis volatiles, J. Agric. Food Chem., 1990, 38, 11, 2050-2053, https://doi.org/10.1021/jf00101a010 . [all data]

Buttery, Teranishi, et al., 1990
Buttery, R.G.; Teranishi, R.; Ling, L.C.; Turnbaugh, J.G., Quantitative and sensory studies on tomato paste volatiles, J. Agric. Food Chem., 1990, 38, 1, 336-340, https://doi.org/10.1021/jf00091a074 . [all data]

Spadone, Takeoka, et al., 1990
Spadone, J.-C.; Takeoka, G.; Liardon, R., Analytical Investigation of Rio Off-Flavor in Green Coffee, J. Agric. Food Chem., 1990, 38, 1, 226-233, https://doi.org/10.1021/jf00091a050 . [all data]

Yang and Sugisawa, 1990
Yang, R.; Sugisawa, H., Citrus Suachi Hort. ex Shirai. Volatile components in Sudachi (Citrus Sudachi Hort. ex Shirai) juice, Nippon Shokuhin Kogyo Gakkaishi, 1990, 37, 12, 946-952, https://doi.org/10.3136/nskkk1962.37.12_946 . [all data]

Georgilopoulos and Gallois, 1988
Georgilopoulos, D.N.; Gallois, A.N., Flavour compounds of a commercial concentrated blackberry juice, Food Chem., 1988, 28, 2, 141-148, https://doi.org/10.1016/0308-8146(88)90143-4 . [all data]

Habu, Flath, et al., 1985
Habu, T.; Flath, R.A.; Mon, T.R.; Morton, J.F., Volatile components of Rooibos tea (Aspalathus linearis), J. Agric. Food Chem., 1985, 33, 2, 249-254, https://doi.org/10.1021/jf00062a024 . [all data]