α-Epoxyconduritol e tetranitrate

Condensed phase thermochemistry data

Data compiled by: Hussein Y. Afeefy, Joel F. Liebman, and Stephen E. Stein

Quantity Value Units Method Reference Comment
Δfsolid-106.2 ± 0.6kcal/molCcbEremenko, Korolev, et al., 1968
Quantity Value Units Method Reference Comment
Δcsolid-663.1 ± 0.6kcal/molCcbEremenko, Korolev, et al., 1968

References

Eremenko, Korolev, et al., 1968
Eremenko, L.T.; Korolev, A.M.; Miroshnichenko, E.A.; Lebedev, Yu.A.; Apin, A.Ya., Thermochemical quantities for conduritol E and some of its derivatives, Russ. J. Phys. Chem. (Engl. Transl.), 1968, 42, 1625-1627. [all data]