1H-Phenanthro[9,10-d]imidazole

Van Den Dool and Kratz RI, non-polar column, custom temperature program

View large format table.

Column type Active phase I Reference Comment
CapillaryMethyl Silicone2075.Oda, Ichikawa, et al., 1996Program: 50C (2min) => 20C/min => 160C => 5C/min => 210C => 10C/min => 300C

References

Oda, Ichikawa, et al., 1996
Oda, J.; Ichikawa, S.; Mori, T., Analysis of polycyclic aromatic hydrocarbons in airborne particulates by capillary GC/MS method with programmed temperature relative retention index, Bunseki Kagaku, 1996, 45, 9, 825-835, https://doi.org/10.2116/bunsekikagaku.45.825 . [all data]