1,2-Anhydro-3,4,5,6-alloinositol

Condensed phase thermochemistry data

Data compiled by: Hussein Y. Afeefy, Joel F. Liebman, and Stephen E. Stein

Quantity Value Units Method Reference Comment
Δfsolid-216.6 ± 0.4kcal/molCcbEremenko, Korolev, et al., 1968
Quantity Value Units Method Reference Comment
Δcsolid-689.3 ± 0.4kcal/molCcbEremenko, Korolev, et al., 1968Corresponding Δfsolid = -216.6 kcal/mol (simple calculation by NIST; no Washburn corrections)

References

Eremenko, Korolev, et al., 1968
Eremenko, L.T.; Korolev, A.M.; Miroshnichenko, E.A.; Lebedev, Yu.A.; Apin, A.Ya., Thermochemical quantities for conduritol E and some of its derivatives, Russ. J. Phys. Chem. (Engl. Transl.), 1968, 42, 1625-1627. [all data]