Gingerol

Van Den Dool and Kratz RI, polar column, temperature ramp

View large format table.

Column type Active phase I Reference Comment
CapillaryDB-Wax4010.Bartley and Jacobs, 200060. m/0.5 mm/0.32 μm, He, 40. C @ 2. min, 4. K/min, 290. C @ 5. min

References

Bartley and Jacobs, 2000
Bartley, J.P.; Jacobs, A.L., Effects of drying on flavour compounds in Australian-grown ginger (Zingiber officinale), J. Sci. Food Agric., 2000, 80, 2, 209-215, https://doi.org/10.1002/(SICI)1097-0010(20000115)80:2<209::AID-JSFA516>3.0.CO;2-8 . [all data]