1-bromo-2-ethoxypropane

Phase change data

Data compiled by: Thermodynamics Research Center, NIST Boulder Laboratories, Chris Muzny director

Quantity Value Units Method Reference Comment
Tboil411.2KN/ASherrill and Walter, 1936Uncertainty assigned by TRC = 0.5 K

In addition to the Thermodynamics Research Center (TRC) data available from this site, much more physical and chemical property data is available from the following TRC products:

References

Sherrill and Walter, 1936
Sherrill, M.L.; Walter, G.F., Preparation and Physical Constants of 2-Methylbutene-1, J. Am. Chem. Soc., 1936, 58, 742. [all data]