Propanoic acid, 2-methyl-, 3,7-dimethyl-2,6-octadienyl ester, (E)-

Kovats' RI, non-polar column, temperature ramp

Data compiled by: NIST Mass Spectrometry Data Center, William E. Wallace, director

Column type CapillaryCapillaryCapillaryCapillaryCapillary
Active phase HP-5Cross-Linked MethylsiliconeBP-1Methyl SiliconeDB-5
Column length (m) 30.50.25.25.30.
Carrier gas HeHeN2N2
Substrate
Column diameter (mm) 0.250.20.550.5
Phase thickness (μm) 1.0.250.25
Tstart (C) 40.100.60.60.40.
Tend (C) 250.280.220.220.210.
Heat rate (K/min) 5.4.5.5.2.
Initial hold (min) 1.   2.
Final hold (min)   15. 120.
I 1516.1491.1487.1489.1513.
ReferenceBouzouita, Kachouri, et al., 2003Rajeswara Rao, Kaul, et al., 2002Jain, Aggarwal, et al., 2001Mallavarapu, Rao, et al., 1998Loayza, Abujder, et al., 1995
Comment MSDC-RI MSDC-RI MSDC-RI MSDC-RI MSDC-RI

Normal alkane RI, non-polar column, temperature ramp

Data compiled by: NIST Mass Spectrometry Data Center, William E. Wallace, director

Column type CapillaryCapillaryCapillaryCapillaryCapillary
Active phase DB-1HP-5MSDB-1DB-5BP-1
Column length (m) 60.30.30.60.25.
Carrier gas NitrogenHe HeN2
Substrate
Column diameter (mm) 0.250.250.320.250.50
Phase thickness (μm) 0.250.250.250.25
Tstart (C) 60.50.60.40.60.
Tend (C) 250.250.230.280.220.
Heat rate (K/min) 5.2.3.4.5.
Initial hold (min)   3.4.
Final hold (min) 10. 10.
I 1514.1514.1493.1514.1491.
ReferenceSonboli, Kanani, et al., 2007Farah, Afifi, et al., 2006Tohar, Mohd, et al., 2006Kalvandi, Sefidkon, et al., 2004Rajeswara, Kaul, et al., 1996
Comment MSDC-RI MSDC-RI MSDC-RI MSDC-RI MSDC-RI

Kovats' RI, polar column, temperature ramp

Data compiled by: NIST Mass Spectrometry Data Center, William E. Wallace, director

Column type CapillaryCapillary
Active phase SupelcowaxCarbowax 20M
Column length (m) 30.25.
Carrier gas  N2
Substrate
Column diameter (mm) 0.250.5
Phase thickness (μm) 0.25
Tstart (C) 60.60.
Tend (C) 240.200.
Heat rate (K/min) 3.5.
Initial hold (min) 5.
Final hold (min) 10.
I 1860.1788.
ReferenceRiu-Aumatell, Castellari, et al., 2004Mallavarapu, Rao, et al., 1998
Comment MSDC-RI MSDC-RI

Normal alkane RI, polar column, temperature ramp

Data compiled by: NIST Mass Spectrometry Data Center, William E. Wallace, director

Column type CapillaryCapillary
Active phase NB-20MInnowax
Column length (m) 30.60.
Carrier gas HeHe
Substrate
Column diameter (mm) 0.20.25
Phase thickness (μm) 0.25
Tstart (C) 50.60.
Tend (C) 250.220.
Heat rate (K/min) 2.4.
Initial hold (min)  10.
Final hold (min)  10.
I 1770.1819.
ReferenceOrav, Raal, et al., 2006Suleimenov, Atazharova, et al., 2003
Comment MSDC-RI MSDC-RI

Phase change data

Data compiled as indicated in comments:
AC - William E. Acree, Jr., James S. Chickos

Enthalpy of vaporization

ΔvapH (kJ/mol) Temperature (K) Method Reference Comment
67.8378.AStephenson and Malanowski, 1987Based on data from 363. - 524. K. See also Stull, 1947.; AC

Antoine Equation Parameters

log10(P) = A − (B / (T + C))
    P = vapor pressure (bar)
    T = temperature (K)

View plot Requires a JavaScript / HTML 5 canvas capable browser.

Temperature (K) A B C Reference Comment
364.1 - 524.5.911752879.996-36.382Stull, 1947Coefficents calculated by NIST from author's data.

Kovats' RI, non-polar column, custom temperature program

Data compiled by: NIST Mass Spectrometry Data Center, William E. Wallace, director

Column type Capillary
Active phase BP-1
Column length (m) 25.
Carrier gas N2
Substrate
Column diameter (mm) 0.32
Phase thickness (μm) 0.25
Program 60C => 5C/min => 220C(5min) => 3C/min => 245C(5min)
I 1495.
ReferenceRaina, Srivastava, et al., 2003
Comment MSDC-RI

Kovats' RI, polar column, isothermal

Data compiled by: NIST Mass Spectrometry Data Center, William E. Wallace, director

Column type Packed
Active phase Carbowax 20M
Column length (m) 2.5
Carrier gas N2
Substrate Embacel
Column diameter (mm)
Phase thickness (μm)
Temperature (C) 150.
I 1821.
Referenceter Heide, 1968
Comment MSDC-RI

Normal alkane RI, polar column, custom temperature program

Data compiled by: NIST Mass Spectrometry Data Center, William E. Wallace, director

Column type CapillaryCapillaryCapillary
Active phase HP Innowax FSPCarbowax 20MHP-Innowax
Column length (m) 60. 60.
Carrier gas N2 He
Substrate
Column diameter (mm) 0.25 0.25
Phase thickness (μm) 0.25 0.25
Program 60C(10min) => 4C/min => 220C(10min) => 1C/min => 240Cnot specified60 0C (10 min) 4 K/min -> 220 0C (10 min) 1 K/min -> 240 0C
I 1819.1795.1819.
ReferenceTabanca N., Demirci B., et al., 2007Vinogradov, 2004Baser, Demirci, et al., 2002
Comment MSDC-RI MSDC-RI MSDC-RI

Van Den Dool and Kratz RI, non-polar column, custom temperature program

Data compiled by: NIST Mass Spectrometry Data Center, William E. Wallace, director

Column type Capillary
Active phase HP-5MS
Column length (m) 30.
Carrier gas He
Substrate
Column diameter (mm) 0.25
Phase thickness (μm) 0.25
Program 60C (1 min) => 5 C/min => 210C => 10 C/min => 280C (15 min)
I 1515.6
ReferenceAndriamaharavo, 2014
Comment MSDC-RI

References

Bouzouita, Kachouri, et al., 2003
Bouzouita, N.; Kachouri, F.; Hamdi, M.; Chaabouni, M.M., Antimicrobial activity of essential oils from Tunisian aromatic plants, Flavour Fragr. J., 2003, 18, 5, 380-383, https://doi.org/10.1002/ffj.1200 . [all data]

Rajeswara Rao, Kaul, et al., 2002
Rajeswara Rao, B.R.; Kaul, P.N.; Syamasundar, K.V.; Ramesh, S., Water soluble fractions of rose scented geranium (Pelargonium species) essential oil, Bioresour. Technol., 2002, 84, 3, 243-246, https://doi.org/10.1016/S0960-8524(02)00057-3 . [all data]

Jain, Aggarwal, et al., 2001
Jain, N.; Aggarwal, K.K.; Syamasundar, K.V.; Srivastava, S.K.; Kumar, S., Essential oil composition of geranium (Pelargonium sp.) from the plains of Northern India, Flavour Fragr. J., 2001, 16, 1, 44-46, https://doi.org/10.1002/1099-1026(200101/02)16:1<44::AID-FFJ943>3.0.CO;2-X . [all data]

Mallavarapu, Rao, et al., 1998
Mallavarapu, G.R.; Rao, B.R.R.; Kaul, P.N.; Ramesh, S.; Bhattacharya, A.K., Volatile constituents of the essential oils of the seeds and the herb of palmarosa (Cymbopogon martinii (Roxb.) Wats. var. motia Burk.), Flavour Fragr. J., 1998, 13, 3, 167-169, https://doi.org/10.1002/(SICI)1099-1026(199805/06)13:3<167::AID-FFJ719>3.0.CO;2-B . [all data]

Loayza, Abujder, et al., 1995
Loayza, I.; Abujder, D.; Aranda, R.; Jakupovic, J.; Collin, G.; Deslauriers, H.; Jean, F.-I., Essential oils of Baccharis salicifolia, B. latifolia and B. dracunculifolia, Phytochemistry, 1995, 38, 2, 381-389, https://doi.org/10.1016/0031-9422(94)00628-7 . [all data]