Propanoic acid, 2-methyl-, 3,7-dimethyl-2,6-octadienyl ester, (Z)-

Kovats' RI, polar column, temperature ramp

Data compiled by: NIST Mass Spectrometry Data Center, William E. Wallace, director

Column type Capillary
Active phase HP-Wax
Column length (m) 50.
Carrier gas He
Substrate
Column diameter (mm) 0.2
Phase thickness (μm) 0.4
Tstart (C) 60.
Tend (C) 230.
Heat rate (K/min) 4.
Initial hold (min)
Final hold (min) 30.
I 1821.
ReferenceGauvin, Lecomte, et al., 2004
Comment MSDC-RI

References

Gauvin, Lecomte, et al., 2004
Gauvin, A.; Lecomte, H.; Smadja, J., Comparative investigations of the essential oils of two scented geranium (Pelargonium spp.) cultivars grown on Reunion Island, Flavour Fragr. J., 2004, 19, 5, 455-460, https://doi.org/10.1002/ffj.1354 . [all data]