1,3-Octanediol

Normal alkane RI, non-polar column, temperature ramp

View large format table.

Column type Active phase I Reference Comment
CapillaryDB5-30W1275.Schwab and Schreier, 198830. m/0.25 mm/0.25 μm, He, 5. K/min; Tstart: 60. C; Tend: 300. C

References

Schwab and Schreier, 1988
Schwab, W.; Schreier, P., Simultaneous enzyme catalysis extraction: A versatile technique for the study of flavor precursors, J. Agric. Food Chem., 1988, 36, 6, 1238-1242, https://doi.org/10.1021/jf00084a028 . [all data]