Propanoic acid, 2-methyl-, 1-methylpropyl ester

Kovats' RI, non-polar column, isothermal

View large format table.

Column type Active phase Temperature (C) I Reference Comment
PackedSE-30100.879.Chastrette, Heintz, et al., 1974N2, Chromosorb W AW (60-80 mesh); Column length: 3. m
PackedApiezon L130.829.Wehrli and Kováts, 1959Celite; Column length: 2.25 m
PackedApiezon L190.827.Wehrli and Kováts, 1959Celite; Column length: 2.25 m

Kovats' RI, polar column, isothermal

View large format table.

Column type Active phase Temperature (C) I Reference Comment
PackedCarbowax 20M100.1057.Chastrette, Heintz, et al., 1974Chromosorb WAW (60-80 mesh); Column length: 3. m

References

Chastrette, Heintz, et al., 1974
Chastrette, M.; Heintz, M.; Druilhe, A.; Lefort, D., Analyse chromatographique d'esters aliphatiques saturés. Relations rétention-structure et prévision de la rétention, Bull. Soc. Chim. Fr., 1974, 9/10,Pt.1, 1852-1856. [all data]

Wehrli and Kováts, 1959
Wehrli, A.; Kováts, E., Gas-chromatographische Charakterisierung ogranischer Verbindungen. Teil 3: Berechnung der Retentionsindices aliphatischer, alicyclischer und aromatischer Verbindungen, Helv. Chim. Acta, 1959, 7, 7, 2709-2736, https://doi.org/10.1002/hlca.19590420745 . [all data]