C11h6f5no2

Gas phase ion energetics data

Data compiled by: John E. Bartmess

De-protonation reactions

C11H5F5NO2- + Hydrogen cation = C11H6F5NO2

By formula: C11H5F5NO2- + H+ = C11H6F5NO2

Quantity Value Units Method Reference Comment
Δr313.5 ± 2.0kcal/molIMREKoppel, Taft, et al., 1994gas phase

Reaction thermochemistry data

Data compiled by: John E. Bartmess

Individual Reactions

C11H5F5NO2- + Hydrogen cation = C11H6F5NO2

By formula: C11H5F5NO2- + H+ = C11H6F5NO2

Quantity Value Units Method Reference Comment
Δr313.5 ± 2.0kcal/molIMREKoppel, Taft, et al., 1994gas phase

References

Koppel, Taft, et al., 1994
Koppel, I.A.; Taft, R.W.; Anvia, F.; Zhu, S.Z.; Hu, L.Q.; Sung, K.S.; Desmarteau, D.D.; Yagupolskii, L.M., The Gas-Phase Acidities of Very Strong Neutral Bronsted Acids, J. Am. Chem. Soc., 1994, 116, 7, 3047, https://doi.org/10.1021/ja00086a038 . [all data]