Dimethylstibine

Phase change data

Data compiled by: William E. Acree, Jr., James S. Chickos

Enthalpy of vaporization

ΔvapH (kcal/mol) Temperature (K) Reference Comment
7.36257.Burg and Grant, 1959Based on data from 241. - 273. K.

References

Burg and Grant, 1959
Burg, Anton B.; Grant, Louis R., The Methylstibines and the Monomer Dimethylstibinoborine, J. Am. Chem. Soc., 1959, 81, 1, 1-5, https://doi.org/10.1021/ja01510a001 . [all data]