7,14-Methano-4H,6H-dipyrido[1,2-a:1',2'-e][1,5]diazocin-4-one, dodecahydro-2-hydroxy-, [2S-(2α,7α,7aβ,14α,14aα)]-

Normal alkane RI, non-polar column, temperature ramp

Data compiled by: NIST Mass Spectrometry Data Center, William E. Wallace, director

Column type Capillary
Active phase DB-1
Column length (m) 30.
Carrier gas Helium
Substrate
Column diameter (mm) 0.32
Phase thickness (μm) 1.0
Tstart (C) 150.
Tend (C) 300.
Heat rate (K/min) 10.
Initial hold (min) 1.
Final hold (min)
I 2255.
ReferenceWink and Witte, 1991
Comment MSDC-RI

References

Wink and Witte, 1991
Wink, M.; Witte, L., Storage of quinolizidine alkaloids in Macrosiphum albifrons and Aphis genistae (Homoptera: Aphididae), Entomol. Gener., 1991, 15, 4, 237-254, https://doi.org/10.1127/entom.gen/15/1991/237 . [all data]