N-methyl decanamide

Phase change data

Data compiled as indicated in comments:
TRC - Thermodynamics Research Center, NIST Boulder Laboratories, Chris Muzny director
AC - William E. Acree, Jr., James S. Chickos

Quantity Value Units Method Reference Comment
Tfus331.KN/ASaavedra, 1979Uncertainty assigned by TRC = 3. K; TRC

Enthalpy of sublimation

ΔsubH (kJ/mol) Temperature (K) Method Reference Comment
102.8 ± 0.8314.GSDavies and Jones, 1959Based on data from 303. - 325. K. See also Stephenson and Malanowski, 1987.; AC

In addition to the Thermodynamics Research Center (TRC) data available from this site, much more physical and chemical property data is available from the following TRC products:

References

Saavedra, 1979
Saavedra, J.E., Reductdion of Nitrosoamides to Alcohols Using Sodium Borohydride, J. Org. Chem., 1979, 44, 860-1. [all data]

Davies and Jones, 1959
Davies, Mansel; Jones, A. Hamilton, Lattice energies of some n-methyl amides and of some carbamates, Trans. Faraday Soc., 1959, 55, 1329, https://doi.org/10.1039/tf9595501329 . [all data]

Stephenson and Malanowski, 1987
Stephenson, Richard M.; Malanowski, Stanislaw, Handbook of the Thermodynamics of Organic Compounds, 1987, https://doi.org/10.1007/978-94-009-3173-2 . [all data]