2-Methylperhydrophenalene

Gas phase ion energetics data

Data compiled by: Sharon G. Lias, John E. Bartmess, Joel F. Liebman, John L. Holmes, Rhoda D. Levin, and W. Gary Mallard

Ionization energy determinations

IE (eV) Method Reference
8.8PEHeilbronner, Honegger, et al., 1984

References

Heilbronner, Honegger, et al., 1984
Heilbronner, E.; Honegger, E.; Zambach, W.; Schmitt, P.; Gunther, H., The persistence of ribbon orbitals in polycyclic alkanes, Helv. Chim. Acta, 1984, 67, 1681. [all data]