Decanamide-

Phase change data

Data compiled as indicated in comments:
TRC - Thermodynamics Research Center, NIST Boulder Laboratories, Chris Muzny director
AC - William E. Acree, Jr., James S. Chickos

Quantity Value Units Method Reference Comment
Tfus371.6KN/ADavies, Jones, et al., 1959Uncertainty assigned by TRC = 0.7 K; TRC

Enthalpy of sublimation

ΔsubH (kJ/mol) Temperature (K) Method Reference Comment
125.9 ± 1.3361.5MEDavies, Jones, et al., 1959Based on data from 353. - 370. K.; AC

Enthalpy of fusion

ΔfusH (kJ/mol) Temperature (K) Method Reference Comment
15.1370.6DSCAbate, Badea, et al., 2008AC

In addition to the Thermodynamics Research Center (TRC) data available from this site, much more physical and chemical property data is available from the following TRC products:

Normal alkane RI, non-polar column, temperature ramp

View large format table.

Column type Active phase I Reference Comment
CapillaryUltra-11521.Okumura, 199125. m/0.32 mm/0.25 μm, He, 3. K/min; Tstart: 80. C; Tend: 260. C

References

Davies, Jones, et al., 1959
Davies, M.; Jones, A.H.; Thomas, G.H., The lattice energies of the straight-chain primary amides, Trans. Faraday Soc., 1959, 55, 1100. [all data]

Abate, Badea, et al., 2008
Abate, Lorenzo; Badea, Elena; Blanco, Ignazio; Della Gatta, Giuseppe, Heat Capacities and Enthalpies of Solid-Solid Transitions and Fusion of a Series of Eleven Primary Alkylamides by Differential Scanning Calorimetry, J. Chem. Eng. Data, 2008, 53, 4, 959-965, https://doi.org/10.1021/je700662a . [all data]