1,1'-Bicycloheptyl

Reaction thermochemistry data

Data compiled by: Hussein Y. Afeefy, Joel F. Liebman, and Stephen E. Stein

Individual Reactions

6Hydrogen + 7,7'-bis(Cycloheptatrienyl) = 1,1'-Bicycloheptyl

By formula: 6H2 + C14H14 = C14H26

Quantity Value Units Method Reference Comment
Δr-138.81 ± 0.20kcal/molChydTurner, Meador, et al., 1957solid phase; solvent: Acetic acid

References

Turner, Meador, et al., 1957
Turner, R.B.; Meador, W.R.; Doering, W.E.; Knox, L.H.; Mayer, J.R.; Wiley, D.W., Heats of hydrogenation. III. Hydrogenation of cycllooctatetraene and of some seven-membered non-benzenoid aromatic compounds, J. Am. Chem. Soc., 1957, 79, 4127-4133. [all data]