2-Pyrrolidinone, seleno-

Gas phase ion energetics data

Data compiled as indicated in comments:
LLK - Sharon G. Lias, Rhoda D. Levin, and Sherif A. Kafafi

Ionization energy determinations

IE (eV) Method Reference Comment
7.6PEAndreocci, Devillanova, et al., 1980LLK
7.70PEAndreocci, Devillanova, et al., 1980Vertical value; LLK

References

Andreocci, Devillanova, et al., 1980
Andreocci, M.V.; Devillanova, F.A.; Furlani, C.; Mattogno, G.; Verani, G.; Zanoni, R., Structural characterization of some substituted azolidine molecules: UPS photoelectron spectroscopic studies, J. Mol. Struct., 1980, 69, 151. [all data]