5-ethyl-(3H)-furan-2-one

Normal alkane RI, polar column, temperature ramp

View large format table.

Column type Active phase I Reference Comment
PackedCarbowax1684.Schieberle and Grosch, 1983He, Chromosorb G AW DMCS, 4. K/min; Column length: 3. m; Tstart: 60. C; Tend: 180. C
PackedCarbowax1697.Schieberle and Grosch, 1983He, Chromosorb G AW DMCS, 4. K/min; Column length: 3. m; Tstart: 60. C; Tend: 180. C

References

Schieberle and Grosch, 1983
Schieberle, P.; Grosch, W., Identifizierung von Aromastoffen aus der Kruste von Roggenbrot, Z. Lebensm. Unters. Forsch., 1983, 177, 3, 173-180, https://doi.org/10.1007/BF01146791 . [all data]