Diazene, bis[4-(decyloxy)phenyl]-, 1-oxide

Phase change data

Data compiled by: Thermodynamics Research Center, NIST Boulder Laboratories, Chris Muzny director

Quantity Value Units Method Reference Comment
Ttriple351.KN/AArnold, 1964Smectic liquid crystal phase; Uncertainty assigned by TRC = 0.1 K

In addition to the Thermodynamics Research Center (TRC) data available from this site, much more physical and chemical property data is available from the following TRC products:

References

Arnold, 1964
Arnold, H., Calorimetry of crystalline-liquid materials: II results of the measurements on 12 homologous dialkoxy azeoxy benzenes, Z. Phys. Chem. (Leipzig), 1964, 226, 146. [all data]