Tricyclo[3.3.1.1(3,7)]decane-1-carbonitrile

Condensed phase thermochemistry data

Data compiled as indicated in comments:
ALS - Hussein Y. Afeefy, Joel F. Liebman, and Stephen E. Stein
DH - Eugene S. Domalski and Elizabeth D. Hearing

Quantity Value Units Method Reference Comment
Δfsolid-88.3 ± 2.5kJ/molCcbAbboud, Jimenez, et al., 1992ALS
Δfsolid-83.5 ± 1.8kJ/molCcbMeier, Dogan, et al., 1987ALS
Quantity Value Units Method Reference Comment
Δcsolid-6384.0 ± 2.1kJ/molCcbAbboud, Jimenez, et al., 1992ALS
Δcsolid-6388.8 ± 1.8kJ/molCcbMeier, Dogan, et al., 1987ALS

Constant pressure heat capacity of solid

Cp,solid (J/mol*K) Temperature (K) Reference Comment
218.6298.15Meier, Dogan, et al., 1987DH

Gas phase thermochemistry data

Data compiled by: Hussein Y. Afeefy, Joel F. Liebman, and Stephen E. Stein

Quantity Value Units Method Reference Comment
Δfgas-5.02 ± 0.62kcal/molCcbAbboud, Jimenez, et al., 1992
Δfgas-1.80 ± 0.50kcal/molCcbMeier, Dogan, et al., 1987

References

Abboud, Jimenez, et al., 1992
Abboud, J.-L.M.; Jimenez, P.; Roux, M.V.; Turrion, C.; Lopez-Mardomingo, C., Structural effects on the thermochemical properties of organic compounds. III. Enthalpies of combustion, vapour pressures and enthalpies of sublimation, and standard enthalpies of formation in the gaseous phase, of adamantane-1-carboxylic acid methyl ester and of adamantane-1-carbonitrile, J. Chem. Thermodyn., 1992, 24, 1299-1304. [all data]

Meier, Dogan, et al., 1987
Meier, M.; Dogan, B.; Beckhaus, H.; Ruchardt, C., Heats of formation and heats of isomerization of isocyanides, New J. Chem., 1987, 11, 1-6. [all data]