trans-Cyclohexane-1,3-dicarboxylic acid

Condensed phase thermochemistry data

Data compiled by: Hussein Y. Afeefy, Joel F. Liebman, and Stephen E. Stein

Quantity Value Units Method Reference Comment
Δcsolid-3871.0 ± 0.2kJ/molCcbvan Maurik, 1950Corresponding Δfsolid = -992.1 kJ/mol (simple calculation by NIST; no Washburn corrections)

References

van Maurik, 1950
van Maurik, D., Verbrandingswarmte van Cyclohexaanmonocarbonzuur en de Cyclohexaandicarbonzuren, Thesis, Amsterdam, 1950, 1-74. [all data]